{"text_format":"1","workbook":"xlsx","n_sheets":24,"sheets":["Instructions","1-Program Metrics","2-Incentives","3-Project Team","4-Spaces","5-Components","6-Energy Rates","7-End Use","8-Cost by Measure","9-Energy Savings by Measure","Tables of Values","Locator Map","Side Calcs - Baseline","ZipCode Map","Worksheet - Design - Baseline","Worksheet - Design - Proposed","Side Calcs - Proposed","10-Financing Plan","11-Schedule","Cx Plan - Measure List","P4P Incentive Structure","Master Export","Support Data","TRC Version Documentation"],"not_rendered":{"charts":0,"images":0,"macros":1,"external_links":1,"defined_names":133,"comments":0,"pivot_tables":0},"unopened":[],"bounds":{"document_bytes":16777216,"sheet_cells":100000,"rows_first":2000,"rows_last":500,"rows_between":2000,"halvings":0,"cell_chars":16384,"cell_head_chars":4096},"cells_cut":0,"cells_raw":0,"read":"whole","date_system":"1900"}

{"sheet":"Instructions","index":0,"n_rows":7,"n_cols":1,"rows_kept":7,"cut":false,"hidden":false,"merged":[[1,0,1,1],[7,0,7,1],[2,0,2,1],[3,0,3,1],[4,0,4,1],[5,0,5,1],[6,0,6,1]]}
["FY2016 NJCEP Pay for Performance New Construction ERP Tables - Version 3.4a (updated 08-09-2016)"]
["Introduction "]
["Pay for Performance  ERP Tables Workbookcalculates a project’s predicted energy reduction and the maximum incentives available through this program.  In addition, this workbook includes tables for the Energy Reduction Plan report."]
["All tables are required for completing  the Energy Reduction Plan. Where possible, data is linked between these tables.  In addition, the tables include the necessary formulas for calculating the financial and other summary statistics.  "]
["Detailed instructions on how to fill out the tables can be found at the top of each tab. Please read instruction carefully before proceeding to fill out each table.  "]
[]
{"$rows_left_out":2}
{"sheet":"1-Program Metrics","index":1,"n_rows":25,"n_cols":6,"rows_kept":25,"cut":false,"hidden":false,"merged":[[4,0,4,4],[0,0,0,5],[1,0,1,5],[2,0,2,5],[16,0,17,0],[8,1,8,7]]}
["New Jersey Office of Clean Energy"]
["Pay for Performance Program"]
["ERP Tables and Incentive Calculator"]
[]
["Table 1.   Summary of Program Metrics "]
["Instructions"]
{"$rows_left_out":20}
{"sheet":"2-Incentives","index":2,"n_rows":91,"n_cols":5,"rows_kept":91,"cut":false,"hidden":false,"merged":[[4,0,4,3],[0,0,0,4],[1,0,1,4],[2,0,2,4]]}
["New Jersey Office of Clean Energy"]
["Pay for Performance Program"]
["ERP Tables and Incentive Calculator"]
[]
["Table 2. Summary of Program Incentives"]
["Note: This table will fill automatically based on other entries in the workbook. "]
{"$rows_left_out":86}
{"sheet":"3-Project Team","index":3,"n_rows":86,"n_cols":6,"rows_kept":86,"cut":false,"hidden":false,"merged":[[4,0,4,3],[0,0,0,4],[1,0,1,4],[2,0,2,4]]}
["New Jersey Office of Clean Energy"]
["Pay for Performance Program"]
["ERP Tables and Incentive Calculator"]
[]
["Table 3. Project Team Contact Information"]
["Instructions"]
{"$rows_left_out":81}
{"sheet":"4-Spaces","index":4,"n_rows":30,"n_cols":6,"rows_kept":30,"cut":false,"hidden":false,"merged":[[11,1,11,2],[4,0,4,5],[6,1,6,5],[7,1,7,5],[0,0,0,7],[1,0,1,7],[2,0,2,7],[8,1,8,5],[9,1,9,5]]}
["New Jersey Office of Clean Energy"]
["Pay for Performance Program"]
["ERP Tables and Incentive Calculator"]
[]
["Table 4. Project Spaces"]
["Instructions"]
{"$rows_left_out":25}
{"sheet":"5-Components","index":5,"n_rows":40,"n_cols":4,"rows_kept":40,"cut":false,"hidden":false,"merged":[[7,1,7,6],[8,1,8,6],[10,0,10,6],[9,0,9,4],[0,0,0,4],[1,0,1,4],[1,5,1,9],[2,0,2,4],[4,0,4,4],[6,1,6,6]]}
["New Jersey Office of Clean Energy"]
["Pay for Performance Program"]
["ERP Tables and Incentive Calculator"]
[]
["Table 5. Proposed and Baseline Components Used in Energy Simulation"]
["Instructions"]
{"$rows_left_out":35}
{"sheet":"6-Energy Rates","index":6,"n_rows":29,"n_cols":4,"rows_kept":29,"cut":false,"hidden":false,"merged":[[20,1,20,3],[8,1,8,8],[0,0,0,8],[1,0,1,8],[2,0,2,8],[4,0,4,2],[7,1,7,10],[9,1,9,10]]}
["New Jersey Office of Clean Energy"]
["Pay for Performance Program"]
["ERP Tables and Incentive Calculator"]
[]
["Table 6. Energy Rates"]
["Instructions"]
{"$rows_left_out":24}
{"sheet":"7-End Use","index":7,"n_rows":26,"n_cols":21,"rows_kept":26,"cut":false,"hidden":false,"merged":[[13,2,13,7],[13,8,13,13],[1,0,1,15],[28,1,28,3],[4,0,4,15],[6,1,6,15],[8,1,8,15],[13,14,13,15],[9,1,9,15],[2,0,2,15],[0,0,0,15],[12,19,12,20],[11,17,11,20],[12,17,12,18],[10,1,10,15],[11,1,11,15],[10,17,10,20]]}
["New Jersey Office of Clean Energy"]
["Pay for Performance Program"]
["ERP Tables and Incentive Calculator"]
[]
["Table 7. Annual Energy Use Summary"]
["Instructions"]
{"$rows_left_out":21}
{"sheet":"8-Cost by Measure","index":8,"n_rows":41,"n_cols":17,"rows_kept":41,"cut":false,"hidden":false,"merged":[[40,12,40,16],[13,1,13,2],[4,0,4,12],[12,13,12,15],[6,1,6,16],[39,12,39,15],[37,12,37,15],[0,0,0,16],[1,0,1,16],[2,0,2,16],[38,12,38,15],[7,1,7,16],[9,1,9,16],[12,4,12,12],[8,1,8,16],[35,12,35,15],[36,12,36,15]]}
["New Jersey Office of Clean Energy"]
["Pay for Performance Program"]
["ERP Tables and Incentive Calculator"]
[]
["Table 8.  Incremental Costs by Energy Efficiency Measure"]
["Instructions"]
{"$rows_left_out":36}
{"sheet":"9-Energy Savings by Measure","index":9,"n_rows":35,"n_cols":74,"rows_kept":35,"cut":false,"hidden":false,"merged":[[8,1,8,15],[10,3,10,4],[10,1,10,2],[0,0,0,12],[1,0,1,12],[2,0,2,12],[4,0,4,24],[6,1,6,15],[7,1,7,15],[9,17,9,20]]}
["New Jersey Office of Clean Energy"]
["Pay for Performance Program"]
["ERP Tables and Incentive Calculator"]
[]
["Table 9.  Annual Energy Savings by Energy Efficiency Measure"]
["Instructions"]
{"$rows_left_out":30}
{"sheet":"Tables of Values","index":10,"n_rows":16,"n_cols":3,"rows_kept":16,"cut":false,"hidden":true,"merged":[[0,0,0,1],[9,0,9,2]]}
["Baseline Fixtures, per EPAct 1992"]
["Fixture","Flow Rate"]
["Baseline Toilets (GPF)",1.6]
["Baseline Urinals (GPF)",1]
["Baseline Showerheads (GPM)",2.5]
["Baseline Bathroom Faucets (GPM)",2.5]
{"$rows_left_out":11}
{"sheet":"Locator Map","index":11,"n_rows":910,"n_cols":15,"rows_kept":910,"cut":false,"hidden":true,"merged":[[0,8,0,11],[0,15,0,17],[0,12,0,14],[909,1,909,4],[909,8,909,11],[909,12,909,14]]}
[null,"actual","actual",null,"actual",null,null,null,"climate mapped",null,null,null,"weather normalization mapped"]
[null,"zip_code","zip_state",null,"zip_city",null,null,null,"city state","state","CDD","HDD","city","state","file name"]
[]
["User",{"$f":"LOOKUP(#REF!,H6:H906,B6:B906)","v":{"$error":"#REF!"}},null,null,null,null,null,{"$f":"LOOKUP(#REF!,H6:H906)","v":{"$error":"#REF!"}}]
[]
[null,"574","\"South_Dakota\"","SD","\"Aberdeen\"",{"$f":"LEN(E6)","v":10},{"$f":"MID(E6,2,F6-2)","v":"Aberdeen"},{"$f":"CONCATENATE(G6,\", \",+D6)","v":"Aberdeen, SD"},"ABERDEEN    SD","SD",633,8446,"Fargo","ND","NDFARGO.txt"]
{"$rows_left_out":905}
{"sheet":"Side Calcs - Baseline","index":12,"n_rows":18,"n_cols":37,"rows_kept":18,"cut":false,"hidden":true,"merged":[[1,35,1,38],[1,19,1,22],[1,23,1,26],[1,27,1,30],[1,1,1,3],[1,15,1,18],[1,7,1,10],[1,11,1,14],[1,4,1,6],[1,31,1,34]]}
[]
[null,null,null,null,null,null,null,"Elec. Units",null,null,null,"Gas Units",null,null,null,"Oil Units",null,null,null,"Steam Units",null,null,null,"Chilled Water Units",null,null,null,"Cooking",null,null,null,"Cooling",null,null,null,"Months in Use"]
[null,null,null,null,null,null,null,null,null,"Source","Site",null,null,"Source","Site",null,null,"Source","Site",null,null,"Source","Site",null,null,"Source","Site",null,null,"Value",null,null,"Value",null,null,null,"Value"]
[null,null,null,null,null,null,null,2,{"$f":"INDIRECT(ADDRESS($H$4+H5,COLUMN(I$2)))","v":"kBTU"},{"$f":"INDIRECT(ADDRESS($H$4+H5,COLUMN(J$2)))","v":3.0187573270808912},{"$f":"INDIRECT(ADDRESS($H$4+H5,COLUMN(K$2)))","v":1},2,{"$f":"INDIRECT(ADDRESS($L$4+L5,COLUMN(M$2)))","v":"kBTU"},{"$f":"INDIRECT(ADDRESS($L$4+L5,COLUMN(N$2)))","v":1.024},{"$f":"INDIRECT(ADDRESS($L$4+L5,COLUMN(O$2)))","v":1},1,{"$f":"INDIRECT(ADDRESS($P$4+P5,COLUMN(Q$2)))","v":"Gal"},{"$f":"INDIRECT(ADDRESS($P$4+P5,COLUMN(R$2)))","v":138.6},{"$f":"INDIRECT(ADDRESS($P$4+P5,COLUMN(S$2)))","v":138.6},2,{"$f":"INDIRECT(ADDRESS($T$4+T5,COLUMN(U$2)))","v":"kBTU"},{"$f":"INDIRECT(ADDRESS($T$4+T5,COLUMN(V$2)))","v":1.38},{"$f":"INDIRECT(ADDRESS($T$4+T5,COLUMN(W$2)))","v":1},1,{"$f":"INDIRECT(ADDRESS($X$4+X5,COLUMN(Y$2)))","v":"Ton-Hrs"},{"$f":"INDIRECT(ADDRESS($X$4+X5,COLUMN(Z$2)))","v":12000},{"$f":"INDIRECT(ADDRESS($X$4+X5,COLUMN(AA$2)))","v":12000},1,{"$f":"INDIRECT(ADDRESS($AB$4+AB5,COLUMN(AC$2)))","v":"Yes"},{"$f":"INDIRECT(ADDRESS($AB$4+AB5,COLUMN(AD$2)))","v":1},null,1,{"$f":"INDIRECT(ADDRESS($AF$4+AF5,COLUMN(AG$2)))","v":0},null,null,2,{"$f":"INDIRECT(ADDRESS($AJ$4+AJ5,COLUMN(AK$2)))","v":10}]
[null,null,null,null,null,null,null,5,null,null,null,5,null,null,null,5,null,null,null,5,null,null,null,5,null,null,null,5,null,null,null,5,null,null,null,5]
[null,null,null,null,null,null,null,null,"kWh",10.3,3.4119999999999999,null,"Therms",{"$f":"100*1.024","v":102.4},100,null,"Gal",138.6,138.6,null,"MLbs",{"$f":"10.78*1.38","v":14.876399999999999},10.78,null,"Ton-Hrs",12000,12000,null,"Yes",1,null,null,0,null,null,null,9]
{"$rows_left_out":13}
{"sheet":"ZipCode Map","index":13,"n_rows":912,"n_cols":15,"rows_kept":912,"cut":false,"hidden":true,"merged":[[0,8,0,11],[0,15,0,17],[0,12,0,14],[911,1,911,4],[911,8,911,11],[911,12,911,14]]}
[null,"actual","actual",null,"actual",null,null,null,"climate mapped",null,null,null,"weather normalization mapped"]
[null,"zip_code","zip_state",null,"zip_city",null,null,null,"city state","state","CDD","HDD","city","state","file name"]
[]
[]
["User Data:",{"$f":"#N/A","v":{"$error":"#N/A"}},{"$f":"LOOKUP($B$5,$B$8:$B$908,C$8:C$908)","v":{"$error":"#N/A"}},{"$f":"LOOKUP($B$5,$B$8:$B$908,D$8:D$908)","v":{"$error":"#N/A"}},{"$f":"LOOKUP($B$5,$B$8:$B$908,E$8:E$908)","v":{"$error":"#N/A"}},null,{"$f":"LOOKUP($B$5,$B$8:$B$908,G$8:G$908)","v":{"$error":"#N/A"}},{"$f":"CONCATENATE(G5,\",\",\" \",D5)","v":{"$error":"#N/A"}},{"$f":"LOOKUP($B$5,$B$8:$B$908,I$8:I$908)","v":{"$error":"#N/A"}},{"$error":"#N/A"},{"$f":"LOOKUP($B$5,$B$8:$B$908,K$8:K$908)","v":{"$error":"#N/A"}},{"$error":"#N/A"},{"$error":"#N/A"},{"$error":"#N/A"},{"$error":"#N/A"}]
[]
{"$rows_left_out":907}
{"sheet":"Worksheet - Design - Baseline","index":14,"n_rows":320,"n_cols":29,"rows_kept":320,"cut":false,"hidden":true,"merged":[[55,7,55,8],[55,10,55,11],[6,3,6,6],[6,7,6,10],[53,7,53,8],[53,10,53,11],[48,5,48,8],[48,10,48,11]]}
["Multi-Family Residential Building"]
["Design Assistant Worksheet"]
[]
[]
["Design Assistant Worksheet"]
[]
{"$rows_left_out":315}
{"sheet":"Worksheet - Design - Proposed","index":15,"n_rows":320,"n_cols":29,"rows_kept":320,"cut":false,"hidden":true,"merged":[[55,7,55,8],[55,10,55,11],[6,3,6,6],[6,7,6,10],[53,7,53,8],[53,10,53,11],[48,5,48,8],[48,10,48,11]]}
["Multi-Family Residential Building"]
["Design Assistant Worksheet"]
[]
[]
["Design Assistant Worksheet"]
[]
{"$rows_left_out":315}
{"sheet":"Side Calcs - Proposed","index":16,"n_rows":18,"n_cols":37,"rows_kept":18,"cut":false,"hidden":true,"merged":[[1,35,1,38],[1,19,1,22],[1,23,1,26],[1,27,1,30],[1,1,1,3],[1,15,1,18],[1,7,1,10],[1,11,1,14],[1,4,1,6],[1,31,1,34]]}
[]
[null,null,null,null,null,null,null,"Elec. Units",null,null,null,"Gas Units",null,null,null,"Oil Units",null,null,null,"Steam Units",null,null,null,"Chilled Water Units",null,null,null,"Cooking",null,null,null,"Cooling",null,null,null,"Months in Use"]
[null,null,null,null,null,null,null,null,null,"Source","Site",null,null,"Source","Site",null,null,"Source","Site",null,null,"Source","Site",null,null,"Source","Site",null,null,"Value",null,null,"Value",null,null,null,"Value"]
[null,null,null,null,null,null,null,2,{"$f":"INDIRECT(ADDRESS($H$4+H5,COLUMN(I$2)))","v":"kBTU"},{"$f":"INDIRECT(ADDRESS($H$4+H5,COLUMN(J$2)))","v":3.0187573270808912},{"$f":"INDIRECT(ADDRESS($H$4+H5,COLUMN(K$2)))","v":1},2,{"$f":"INDIRECT(ADDRESS($L$4+L5,COLUMN(M$2)))","v":"kBTU"},{"$f":"INDIRECT(ADDRESS($L$4+L5,COLUMN(N$2)))","v":1.024},{"$f":"INDIRECT(ADDRESS($L$4+L5,COLUMN(O$2)))","v":1},1,{"$f":"INDIRECT(ADDRESS($P$4+P5,COLUMN(Q$2)))","v":"Gal"},{"$f":"INDIRECT(ADDRESS($P$4+P5,COLUMN(R$2)))","v":138.6},{"$f":"INDIRECT(ADDRESS($P$4+P5,COLUMN(S$2)))","v":138.6},2,{"$f":"INDIRECT(ADDRESS($T$4+T5,COLUMN(U$2)))","v":"kBTU"},{"$f":"INDIRECT(ADDRESS($T$4+T5,COLUMN(V$2)))","v":1.38},{"$f":"INDIRECT(ADDRESS($T$4+T5,COLUMN(W$2)))","v":1},1,{"$f":"INDIRECT(ADDRESS($X$4+X5,COLUMN(Y$2)))","v":"Ton-Hrs"},{"$f":"INDIRECT(ADDRESS($X$4+X5,COLUMN(Z$2)))","v":12000},{"$f":"INDIRECT(ADDRESS($X$4+X5,COLUMN(AA$2)))","v":12000},1,{"$f":"INDIRECT(ADDRESS($AB$4+AB5,COLUMN(AC$2)))","v":"Yes"},{"$f":"INDIRECT(ADDRESS($AB$4+AB5,COLUMN(AD$2)))","v":1},null,1,{"$f":"INDIRECT(ADDRESS($AF$4+AF5,COLUMN(AG$2)))","v":0},null,null,2,{"$f":"INDIRECT(ADDRESS($AJ$4+AJ5,COLUMN(AK$2)))","v":10}]
[null,null,null,null,null,null,null,5,null,null,null,5,null,null,null,5,null,null,null,5,null,null,null,5,null,null,null,5,null,null,null,5,null,null,null,5]
[null,null,null,null,null,null,null,null,"kWh",10.3,3.4119999999999999,null,"Therms",{"$f":"100*1.024","v":102.4},100,null,"Gal",138.6,138.6,null,"MLbs",{"$f":"10.78*1.38","v":14.876399999999999},10.78,null,"Ton-Hrs",12000,12000,null,"Yes",1,null,null,0,null,null,null,9]
{"$rows_left_out":13}
{"sheet":"10-Financing Plan","index":17,"n_rows":22,"n_cols":4,"rows_kept":22,"cut":false,"hidden":false,"merged":[[21,0,21,3],[4,0,4,4],[0,0,0,4],[1,0,1,4],[2,0,2,4],[9,1,9,2],[16,1,16,2],[7,1,7,4],[6,1,6,5]]}
["New Jersey Office of Clean Energy"]
["Pay for Performance Program"]
["ERP Tables and Incentive Calculator"]
[]
["Table 10. Financing Plan"]
["Instructions"]
{"$rows_left_out":17}
{"sheet":"11-Schedule","index":18,"n_rows":16,"n_cols":4,"rows_kept":16,"cut":false,"hidden":false,"merged":[[8,1,8,5],[4,0,4,4],[0,0,0,4],[1,0,1,4],[2,0,2,4],[6,1,6,5],[7,1,7,5]]}
["New Jersey Office of Clean Energy"]
["Pay for Performance Program"]
["ERP Tables and Incentive Calculator"]
[]
["Table 11. Construction Schedule"]
["Instructions"]
{"$rows_left_out":11}
{"sheet":"Cx Plan - Measure List","index":19,"n_rows":31,"n_cols":11,"rows_kept":31,"cut":false,"hidden":false,"merged":[[7,1,7,10],[0,0,0,10],[1,0,1,10],[2,0,2,10],[10,1,10,2],[4,0,4,10],[6,1,6,10],[10,5,10,6],[10,8,10,9],[8,1,8,10]]}
["New Jersey Office of Clean Energy"]
["Pay for Performance Program"]
["ERP Tables and Incentive Calculator"]
[]
["Comissioning Plan: List of Measures"]
["Instructions"]
{"$rows_left_out":26}
{"sheet":"P4P Incentive Structure","index":20,"n_rows":17,"n_cols":5,"rows_kept":17,"cut":false,"hidden":false,"merged":[[0,0,0,5],[1,0,1,5],[2,0,2,5],[3,2,3,3],[3,4,3,5],[3,0,3,1],[4,2,4,3],[4,4,4,5],[5,0,5,1],[8,0,8,1],[16,0,16,5],[4,0,4,1],[8,2,8,3],[8,4,8,5],[11,0,11,5],[5,2,5,3],[5,4,5,5],[9,0,9,1],[9,2,9,3],[9,4,9,5],[10,0,10,5],[6,0,6,5],[7,0,7,5],[12,0,12,1],[12,2,12,3],[12,4,12,5],[13,0,15,0],[13,2,13,3],[13,4,15,5],[14,2,14,3],[15,2,15,3]]}
["Incentive Structure for Pay For Performance  "]
[" New Construction Program"]
["Incentive #1: Proposed Energy Reduction Plan Completion / Design Fees"]
["Minimum Performance Requirement:",null,0.15,null,"Cost reduction from 90.1-2007 Baseline"]
["Incentive Amount:",null,0.1,null,"per gross heated square foot"]
["Maximum Incentive:",null,50000]
{"$rows_left_out":12}
{"sheet":"Master Export","index":21,"n_rows":23,"n_cols":48,"rows_kept":23,"cut":false,"hidden":true,"merged":[]}
["Pay For Performance - New Construction: 2016"]
["Project Name",0,"Project ID",0,"Street Address",0,"Project SF",{"$f":"'2-Incentives'!C9","v":0},"Partner Fees",{"$f":"SUM('8-Cost by Measure'!Q37:Q39)","v":0},"Total Measure Cost",{"$f":"SUM('8-Cost by Measure'!L15:L34)","v":0},"Total Measure Incremental Cost",{"$f":"'8-Cost by Measure'!Q36","v":0},"Committed Incentive #1",{"$f":"'2-Incentives'!C11","v":0},"Paid Incentive #1",0,"Committed Incentive #2",{"$f":"'2-Incentives'!C12","v":0},"Paid Incentive #2",0,"Committed Incentive #3",{"$f":"'2-Incentives'!C13","v":0},"Paid Incentive #3",0,"Annual Energy Cost - Baseline",{"$f":"'1-Program Metrics'!C14","v":0},"Annual Cost Savings",{"$f":"'1-Program Metrics'!E14","v":0},"Internal Rate of Return (IRR)",{"$f":"'9-Energy Savings by Measure'!M33","v":""},"Life Cycle Savings",{"$f":"'9-Energy Savings by Measure'!N33","v":0},"Simple Payback (yrs)",{"$f":"'9-Energy Savings by Measure'!L33","v":0},"Simple Payback with NJCEP Incentive (yrs)",{"$f":"('8-Cost by Measure'!Q40-'10-Financing Plan'!C11)/'9-Energy Savings by Measure'!J33","v":{"$error":"#DIV/0!"}},"Total % Cost Savings",{"$f":"'1-Program Metrics'!F14","v":0},"Total % Energy Savings",{"$f":"'1-Program Metrics'!F19","v":0},"% Elec",{"$f":"'1-Program Metrics'!F15","v":0},"% Gas",{"$f":"'1-Program Metrics'!F16","v":0},"% Other",{"$f":"SUM('1-Program Metrics'!F17:F18)","v":0}]
["Measure Name","Measure Description","Manufacturer","Model","Installation Cost per Unit","Annual Energy Cost Savings per Unit","Incentive Per Unit","Simple Payback w/o Incentives","Simple Payback w/ Incentives","Peak Demand Reduction per Unit","Annual Electricity Savings per Unit","Lifetime Electricity Savings per Unit","Annual Gas Savings per Unit","Lifetime Gas Savings per Unit","Annual Propane Savings per Unit","Lifetime Propane Savings per Unit","Annual Oil Savings per Unit","Lifetime Oil Savings per Unit","Other Energy Savings MMBTU per Unit","Other Lifetime Energy Savings MMBTU per Unit","CO2e Emissions Reduction per Unit (lbs)","Quantity Committed","Quantity Installed"]
[{"$f":"'8-Cost by Measure'!C15","v":0},{"$f":"'8-Cost by Measure'!D15","v":0},{"$f":"'8-Cost by Measure'!E15","v":0},{"$f":"'8-Cost by Measure'!F15","v":0},{"$f":"IFERROR('8-Cost by Measure'!L15/V4,0)","v":0},{"$f":"IFERROR('9-Energy Savings by Measure'!J12/V4,0)","v":0},{"$f":"IFERROR(('2-Incentives'!$C$12+'2-Incentives'!$C$13)*'8-Cost by Measure'!Q15/'8-Cost by Measure'!$Q$36/V4,0)","v":0},{"$f":"'9-Energy Savings by Measure'!L12","v":0},{"$f":"IFERROR(('8-Cost by Measure'!Q15-(G4*V4))/'9-Energy Savings by Measure'!J12,0)","v":0},{"$f":"IFERROR('9-Energy Savings by Measure'!G12/V4,0)","v":0},{"$f":"IFERROR('9-Energy Savings by Measure'!E12/V4,0)","v":0},{"$f":"IFERROR('9-Energy Savings by Measure'!E12*'9-Energy Savings by Measure'!K12/V4,0)","v":0},{"$f":"IFERROR('9-Energy Savings by Measure'!D12/V4,0)","v":0},{"$f":"IFERROR('9-Energy Savings by Measure'!D12*'9-Energy Savings by Measure'!K12/V4,0)","v":0},0,0,0,0,0,0,{"$f":"IFERROR((K4*'Support Data'!$AH$12+M4*'Support Data'!$AH$11+O4*'Support Data'!$AH$10+Q4*'Support Data'!$AH$8+S4*'Support Data'!$AH$9)/V4,0)","v":0},{"$f":"IFERROR('8-Cost by Measure'!I15*1,1)","v":0},{"$f":"IFERROR('8-Cost by Measure'!I15*1,1)","v":0},"Capacity/Size",{"$f":"'8-Cost by Measure'!G15","v":0},"Capacity/Size Units",{"$f":"'8-Cost by Measure'!H15","v":0},"Efficiency",{"$f":"'8-Cost by Measure'!J15","v":0},"Efficiency Units",{"$f":"'8-Cost by Measure'!K15","v":0}]
[{"$f":"'8-Cost by Measure'!C16","v":0},{"$f":"'8-Cost by Measure'!D16","v":0},{"$f":"'8-Cost by Measure'!E16","v":0},{"$f":"'8-Cost by Measure'!F16","v":0},{"$f":"IFERROR('8-Cost by Measure'!L16/V5,0)","v":0},{"$f":"IFERROR('9-Energy Savings by Measure'!J13/V5,0)","v":0},{"$f":"IFERROR(('2-Incentives'!$C$12+'2-Incentives'!$C$13)*'8-Cost by Measure'!Q16/'8-Cost by Measure'!$Q$36/V5,0)","v":0},{"$f":"'9-Energy Savings by Measure'!L13","v":0},{"$f":"IFERROR(('8-Cost by Measure'!Q16-(G5*V5))/'9-Energy Savings by Measure'!J13,0)","v":0},{"$f":"IFERROR('9-Energy Savings by Measure'!G13/V5,0)","v":0},{"$f":"IFERROR('9-Energy Savings by Measure'!E13/V5,0)","v":0},{"$f":"IFERROR('9-Energy Savings by Measure'!E13*'9-Energy Savings by Measure'!K13/V5,0)","v":0},{"$f":"IFERROR('9-Energy Savings by Measure'!D13/V5,0)","v":0},{"$f":"IFERROR('9-Energy Savings by Measure'!D13*'9-Energy Savings by Measure'!K13/V5,0)","v":0},0,0,0,0,0,0,{"$f":"IFERROR((K5*'Support Data'!$AH$12+M5*'Support Data'!$AH$11+O5*'Support Data'!$AH$10+Q5*'Support Data'!$AH$8+S5*'Support Data'!$AH$9)/V5,0)","v":0},{"$f":"IFERROR('8-Cost by Measure'!I16*1,1)","v":0},{"$f":"IFERROR('8-Cost by Measure'!I16*1,1)","v":0},"Capacity/Size",{"$f":"'8-Cost by Measure'!G16","v":0},"Capacity/Size Units",{"$f":"'8-Cost by Measure'!H16","v":0},"Efficiency",{"$f":"'8-Cost by Measure'!J16","v":0},"Efficiency Units",{"$f":"'8-Cost by Measure'!K16","v":0}]
[{"$f":"'8-Cost by Measure'!C17","v":0},{"$f":"'8-Cost by Measure'!D17","v":0},{"$f":"'8-Cost by Measure'!E17","v":0},{"$f":"'8-Cost by Measure'!F17","v":0},{"$f":"IFERROR('8-Cost by Measure'!L17/V6,0)","v":0},{"$f":"IFERROR('9-Energy Savings by Measure'!J14/V6,0)","v":0},{"$f":"IFERROR(('2-Incentives'!$C$12+'2-Incentives'!$C$13)*'8-Cost by Measure'!Q17/'8-Cost by Measure'!$Q$36/V6,0)","v":0},{"$f":"'9-Energy Savings by Measure'!L14","v":0},{"$f":"IFERROR(('8-Cost by Measure'!Q17-(G6*V6))/'9-Energy Savings by Measure'!J14,0)","v":0},{"$f":"IFERROR('9-Energy Savings by Measure'!G14/V6,0)","v":0},{"$f":"IFERROR('9-Energy Savings by Measure'!E14/V6,0)","v":0},{"$f":"IFERROR('9-Energy Savings by Measure'!E14*'9-Energy Savings by Measure'!K14/V6,0)","v":0},{"$f":"IFERROR('9-Energy Savings by Measure'!D14/V6,0)","v":0},{"$f":"IFERROR('9-Energy Savings by Measure'!D14*'9-Energy Savings by Measure'!K14/V6,0)","v":0},0,0,0,0,0,0,{"$f":"IFERROR((K6*'Support Data'!$AH$12+M6*'Support Data'!$AH$11+O6*'Support Data'!$AH$10+Q6*'Support Data'!$AH$8+S6*'Support Data'!$AH$9)/V6,0)","v":0},{"$f":"IFERROR('8-Cost by Measure'!I17*1,1)","v":0},{"$f":"IFERROR('8-Cost by Measure'!I17*1,1)","v":0},"Capacity/Size",{"$f":"'8-Cost by Measure'!G17","v":0},"Capacity/Size Units",{"$f":"'8-Cost by Measure'!H17","v":0},"Efficiency",{"$f":"'8-Cost by Measure'!J17","v":0},"Efficiency Units",{"$f":"'8-Cost by Measure'!K17","v":0}]
{"$rows_left_out":18}
{"sheet":"Support Data","index":22,"n_rows":82,"n_cols":34,"rows_kept":82,"cut":false,"hidden":true,"merged":[[6,33,6,35],[1,32,1,35],[2,33,2,35],[3,33,3,35],[4,33,4,35],[5,33,5,35],[7,33,7,35],[8,33,8,35],[9,33,9,35],[10,33,10,35],[11,33,11,35]]}
[]
[null,"Incentive #3 $/SF",null,"Garage_Type",null,"Y_N",null,"Space_Type",null,"Project_Stage",null,"Gas_Unit",null,"Electric_Unit",null,"Cost_Source",null,"Measure_Type",null,"Capacity_Units",null,"Efficiency_Units",null,"Fuel_Type",null,"Measure","days/ year","hours/ day","Diversity factor",null,"CHP_Fuel",null,"CO2e Lookup"]
[null,{"$f":"IF('1-Program Metrics'!F14<0.15,0,IF(AND('1-Program Metrics'!F14>=0.15,'1-Program Metrics'!F14<0.18),'P4P Incentive Structure'!C14,IF(AND('1-Program Metrics'!F14>=0.18,'1-Program Metrics'!F14<0.21),'P4P Incentive Structure'!C15,'P4P Incentive Structure'!C16)))","v":0},null,"None",null,"Y/N",null,"ASHRAE space type",null,"<Choose>",null,"Choose unit:",null,"Choose unit:",null,"Baseline Cost Estimator",null,"Pre-Design Planning",null,"BTUH",null,"EER",null,"electricity",null,"Measure with no Demand Savings",365,24,0,null,"Choose fuel:",null,"Fuel Type","Lbs CO2 Equivalent per MMBtu or kWh"]
[null,null,null,"Under Ground",null,"Yes",null,"Apartment Space",null,"Proposed Design",null,"Btu",null,"Btu",null,"Bid Results",null,"Design Simulation & Screening",null,"DCW",null,"SEER",null,"gas",null,"---- Envelope/Shell Measures (where AC is present) -----","----","----","----",null,"Gas",null,null,0]
[null,null,null,"Above Ground",null,"No",null,"Office-Enclosed",null,"As-Built",null,"kBtu",null,"kBtu",null,"Contractor",null,"Final Design",null,"HP",null,"AFUE",null,"oil",null,"Air conditioner sleeves, seal",62.5,8,0,null,"Oil",null,"N/A",0]
[null,null,null,"Parking Lot",null,null,null,"Office-Open Plan",null,null,null,"MMBtu",null,"MMBtu",null,"Developer",null,"Water Cooled Chiller (Electric) - Partial Load",null,"MBH",null,"CFM",null,"propane",null,"Envelope penetrations, seal",62.5,8,0,null,null,null,"No. 6 Fuel Oil",{"$f":"75.35*2.20462","v":166.11811699999998}]
{"$rows_left_out":77}
{"sheet":"TRC Version Documentation","index":23,"n_rows":32,"n_cols":3,"rows_kept":32,"cut":false,"hidden":true,"merged":[]}
[]
["v1.0 released 11/17/09, after first P4P NC Orientation."]
[]
["v2.0 released 1/17/11, and includes: "]
[null,"updates to ASHRAE space type list"]
[null,"minor updates to instructions"]
{"$rows_left_out":26}