{"text_format":"1","workbook":"xlsx","n_sheets":5,"sheets":["Worksheet","Measure Code","Table","Export","Version"],"not_rendered":{"charts":0,"images":0,"macros":1,"external_links":0,"defined_names":13,"comments":0,"pivot_tables":0},"unopened":[],"bounds":{"document_bytes":16777216,"sheet_cells":100000,"rows_first":2000,"rows_last":500,"rows_between":2000,"halvings":0,"cell_chars":16384,"cell_head_chars":4096},"cells_cut":0,"cells_raw":0,"read":"whole","date_system":"1900"}

{"sheet":"Worksheet","index":0,"n_rows":40,"n_cols":31,"rows_kept":40,"cut":false,"hidden":false,"merged":[[0,0,0,3],[2,16,2,18],[3,21,3,23],[3,24,3,26],[4,21,8,23],[4,24,8,26],[10,21,10,22],[13,16,13,17],[3,16,3,18],[13,1,13,3],[7,1,7,2],[5,1,5,3],[3,1,3,3],[3,5,3,10],[7,5,7,10],[8,5,8,6],[8,1,8,2],[4,1,4,3]]}
["FY22 SmartStart Existing Buildings - Gas Water Heating v1.0",null,null,null,"Incentive amounts are estimates until verified by the Program Manager."]
[]
["Customer Information",null,null,null,null,null,null,null,null,null,null,null,null,null,null,null,"Total Units Committed:",null,null,{"$f":"SUM(O16:O40)","v":0}]
["Company",null,null,null,"Address",null,null,null,null,null,null,null,null,null,null,null,"Total Units Installed:",null,null,{"$f":"SUM(P16:P40)","v":0},null,"Pre-Inspection Notes",null,null,"Post-Inspection Notes"]
["Application",null,null,null,"Date"]
["Contact"]
["Contractor/Vendor Information"]
["Company",null,null,null,"Address"]
["Contact",null,null," ","Phone"]
["Enhanced Incentive Eligibility"]
{"$rows_left_out":31}
{"sheet":"Measure Code","index":1,"n_rows":15,"n_cols":13,"rows_kept":15,"cut":false,"hidden":true,"merged":[]}
["Measure Code","Type","Description","Min Capacity\n(MBH)","Max Capacity\n(MBH)","Min. Eff\n(EF)","Min. Eff\n(UEF)","Min. Eff\n(Et)","Tier","Incentive","Incentive Units","Measure Life","Measure Type"]
["GWH1","W","Tank Style Water Heater ≤ 75 MBH",0.01,75,"N/A",0.64,"N/A",1,1.75,"per MBH",15,87]
["GWH2","W","Tank Style Water Heater ≤ 75 MBH",0.01,75,"N/A",0.85,"N/A",2,3.5,"per MBH",15,87]
["GWH3","W","Tank Style Water Heater > 75 MBH and ≤105 MBH",75.010000000000005,105,"N/A",0.64,0.82,1,1.75,"per MBH",15,87]
["GWH4","W","Tank Style Water Heater > 75 MBH and ≤105 MBH",75.010000000000005,105,"N/A",0.85,0.9,2,3.5,"per MBH",15,87]
["GWH5","W","Tank Style Water Heater > 105 MBH",105.01,999999,"N/A","N/A",0.82,1,1.75,"per MBH",15,87]
["GWH6","W","Tank Style Water Heater > 105 MBH",105.01,999999,"N/A","N/A",0.92,2,3.5,"per MBH",15,87]
["GWH7","T","Tankless Water Heater < 200 MBH",0.01,199.99999,"N/A",0.9,0.9,"N/A",300,"per Unit",20,87]
["GWH8","T","Tankless Water Heater ≥ 200 MBH",200,999999,"N/A","N/A",0.9,"N/A",300,"per Unit",20,87]
["GWH9","B","Booster Water Heater ≤ 100 MBH",0.01,100,"N/A","N/A","N/A","N/A",35,"per MBH",15,87]
{"$rows_left_out":6}
{"sheet":"Table","index":2,"n_rows":28,"n_cols":15,"rows_kept":28,"cut":false,"hidden":true,"merged":[[18,0,18,1]]}
["Building Type","Energy Use Density (kBtu/sf/yr)",null,"GWH1_EffUnits","GWH2_EffUnits","GWH3_EffUnits","GWH4_EffUnits","GWH5_EffUnits","GWH6_EffUnits","GWH7_EffUnits","GWH8_EffUnits","GWH9_EffUnits","GWH10_EffUnits",null,"Water Heater Type"]
["Education",7,null,"UEF","UEF","UEF","UEF","Et","Et","UEF","Et",null,null,null,"Tank Type"]
["Food Sales",4.4000000000000004,null,null,null,"Et","Et",null,null,"Et",null,null,null,null,"Instantaneous"]
["Food Service",39.200000000000003]
["Health Care",23.7]
["Health Care - Inpatient",34.299999999999997]
["Health Care - Outpatient",3.9]
["Lodging",26.5]
["Retail (Other Than Mall)",2.5]
["Enclosed and Strip Malls",14.1]
{"$rows_left_out":19}
{"sheet":"Export","index":3,"n_rows":26,"n_cols":25,"rows_kept":26,"cut":false,"hidden":true,"merged":[]}
["Measure Type","Manufacturer","Model","Capacity/Size","Capacity/Size Units","EER Efficiency","SEER Efficiency","Incentive Per Unit","Quantity Committed","Annual Electricity Savings","Peak Demand Reduction","Lifetime Electricity Savings","Annual Gas Savings","Lifetime Gas Savings","Efficiency- other","Efficiency- other-type","Measure ID removed","Quantity Installed","Project in UEZ","Project in OZ","Municipality","K-12 School","County","Affordable Housing","Enhanced Incentive per Unit"]
[{"$f":"IF(Worksheet!C16=\"LF\",252,IF(Worksheet!C16=\"LS\",252,IF(ISBLANK(Worksheet!O16)=FALSE,IF(ISBLANK(Worksheet!F16)=FALSE,IF(Worksheet!F16>50,88,87),87),\"\")))","v":""},{"$f":"IF(ISBLANK(Worksheet!D16) = FALSE,Worksheet!D16,\"\")","v":""},{"$f":"IF(ISBLANK(Worksheet!E16) = FALSE,Worksheet!E16,\"\")","v":""},{"$f":"IF(OR(Worksheet!C16=\"LF\",Worksheet!C16=\"LS\")=TRUE,Worksheet!N16,IF(Worksheet!F16=\"\",IF(Worksheet!G16=\"\",\"\",Worksheet!G16),Worksheet!F16))","v":""},{"$f":"IF(OR(Worksheet!C16=\"LF\",Worksheet!C16=\"LS\")=TRUE,\"GPM\",IF(Worksheet!F16=\"\",IF(Worksheet!G16=\"\",\"\",\"MBh\"),\"Gallons\"))","v":""},null,null,{"$f":"IF(Worksheet!Q16>0,Worksheet!Q16,\"\")","v":""},{"$f":"IF(ISBLANK(Worksheet!O16)=FALSE,Worksheet!O16,\"\")","v":""},{"$f":"IFERROR(Worksheet!Y16/I2,\"\")","v":""},{"$f":"IFERROR(Worksheet!AA16/I2,\"\")","v":""},{"$f":"IFERROR(Worksheet!AC16/I2,\"\")","v":""},{"$f":"IFERROR(IF(ISBLANK(Worksheet!U16)=FALSE, Worksheet!U16,\"\")/I2,0)","v":0},{"$f":"IFERROR(IF(ISBLANK(Worksheet!W16)=FALSE, Worksheet!W16,\"\")/I2,0)","v":0},{"$f":"IF(ISBLANK(Worksheet!H16)=FALSE, Worksheet!H16,\"\")","v":""},{"$f":"IF(ISBLANK(Worksheet!I16)=FALSE, Worksheet!I16,\"\")","v":""},null,{"$f":"IF(ISBLANK(Worksheet!P16)=FALSE,Worksheet!P16,\"\")","v":""},{"$f":"IF(Worksheet!$A$11=TRUE,\"Y\",\"N\")","v":"N"},{"$f":"IF(Worksheet!$A$12=TRUE,\"Y\",\"N\")","v":"N"},{"$f":"IF(Worksheet!$B$11=TRUE,\"Y\",\"N\")","v":"N"},{"$f":"IF(Worksheet!$B$12=TRUE,\"Y\",\"N\")","v":"N"},{"$f":"IF(Worksheet!$C$11=TRUE,\"Y\",\"N\")","v":"N"},{"$f":"IF(Worksheet!$C$12=TRUE,\"Y\",\"N\")","v":"N"},{"$f":"IFERROR(Worksheet!R16,\"\")","v":0}]
[{"$f":"IF(Worksheet!C17=\"LF\",252,IF(Worksheet!C17=\"LS\",252,IF(ISBLANK(Worksheet!O17)=FALSE,IF(ISBLANK(Worksheet!F17)=FALSE,IF(Worksheet!F17>50,88,87),87),\"\")))","v":""},{"$f":"IF(ISBLANK(Worksheet!D17) = FALSE,Worksheet!D17,\"\")","v":""},{"$f":"IF(ISBLANK(Worksheet!E17) = FALSE,Worksheet!E17,\"\")","v":""},{"$f":"IF(OR(Worksheet!C17=\"LF\",Worksheet!C17=\"LS\")=TRUE,Worksheet!N17,IF(Worksheet!F17=\"\",IF(Worksheet!G17=\"\",\"\",Worksheet!G17),Worksheet!F17))","v":""},{"$f":"IF(OR(Worksheet!C17=\"LF\",Worksheet!C17=\"LS\")=TRUE,\"GPM\",IF(Worksheet!F17=\"\",IF(Worksheet!G17=\"\",\"\",\"MBh\"),\"Gallons\"))","v":""},null,null,{"$f":"IF(Worksheet!Q17>0,Worksheet!Q17,\"\")","v":""},{"$f":"IF(ISBLANK(Worksheet!O17)=FALSE,Worksheet!O17,\"\")","v":""},{"$f":"IFERROR(Worksheet!Y17/I3,\"\")","v":""},{"$f":"IFERROR(Worksheet!AA17/I3,\"\")","v":""},{"$f":"IFERROR(Worksheet!AC17/I3,\"\")","v":""},{"$f":"IFERROR(IF(ISBLANK(Worksheet!U17)=FALSE, Worksheet!U17,\"\")/I3,0)","v":0},{"$f":"IFERROR(IF(ISBLANK(Worksheet!W17)=FALSE, Worksheet!W17,\"\")/I3,0)","v":0},{"$f":"IF(ISBLANK(Worksheet!H17)=FALSE, Worksheet!H17,\"\")","v":""},{"$f":"IF(ISBLANK(Worksheet!I17)=FALSE, Worksheet!I17,\"\")","v":""},null,{"$f":"IF(ISBLANK(Worksheet!P17)=FALSE,Worksheet!P17,\"\")","v":""},{"$f":"IF(Worksheet!$A$11=TRUE,\"Y\",\"N\")","v":"N"},{"$f":"IF(Worksheet!$A$12=TRUE,\"Y\",\"N\")","v":"N"},{"$f":"IF(Worksheet!$B$11=TRUE,\"Y\",\"N\")","v":"N"},{"$f":"IF(Worksheet!$B$12=TRUE,\"Y\",\"N\")","v":"N"},{"$f":"IF(Worksheet!$C$11=TRUE,\"Y\",\"N\")","v":"N"},{"$f":"IF(Worksheet!$C$12=TRUE,\"Y\",\"N\")","v":"N"},{"$f":"IFERROR(Worksheet!R17,\"\")","v":0}]
[{"$f":"IF(Worksheet!C18=\"LF\",252,IF(Worksheet!C18=\"LS\",252,IF(ISBLANK(Worksheet!O18)=FALSE,IF(ISBLANK(Worksheet!F18)=FALSE,IF(Worksheet!F18>50,88,87),87),\"\")))","v":""},{"$f":"IF(ISBLANK(Worksheet!D18) = FALSE,Worksheet!D18,\"\")","v":""},{"$f":"IF(ISBLANK(Worksheet!E18) = FALSE,Worksheet!E18,\"\")","v":""},{"$f":"IF(OR(Worksheet!C18=\"LF\",Worksheet!C18=\"LS\")=TRUE,Worksheet!N18,IF(Worksheet!F18=\"\",IF(Worksheet!G18=\"\",\"\",Worksheet!G18),Worksheet!F18))","v":""},{"$f":"IF(OR(Worksheet!C18=\"LF\",Worksheet!C18=\"LS\")=TRUE,\"GPM\",IF(Worksheet!F18=\"\",IF(Worksheet!G18=\"\",\"\",\"MBh\"),\"Gallons\"))","v":""},null,null,{"$f":"IF(Worksheet!Q18>0,Worksheet!Q18,\"\")","v":""},{"$f":"IF(ISBLANK(Worksheet!O18)=FALSE,Worksheet!O18,\"\")","v":""},{"$f":"IFERROR(Worksheet!Y18/I4,\"\")","v":""},{"$f":"IFERROR(Worksheet!AA18/I4,\"\")","v":""},{"$f":"IFERROR(Worksheet!AC18/I4,\"\")","v":""},{"$f":"IFERROR(IF(ISBLANK(Worksheet!U18)=FALSE, Worksheet!U18,\"\")/I4,0)","v":0},{"$f":"IFERROR(IF(ISBLANK(Worksheet!W18)=FALSE, Worksheet!W18,\"\")/I4,0)","v":0},{"$f":"IF(ISBLANK(Worksheet!H18)=FALSE, Worksheet!H18,\"\")","v":""},{"$f":"IF(ISBLANK(Worksheet!I18)=FALSE, Worksheet!I18,\"\")","v":""},null,{"$f":"IF(ISBLANK(Worksheet!P18)=FALSE,Worksheet!P18,\"\")","v":""},{"$f":"IF(Worksheet!$A$11=TRUE,\"Y\",\"N\")","v":"N"},{"$f":"IF(Worksheet!$A$12=TRUE,\"Y\",\"N\")","v":"N"},{"$f":"IF(Worksheet!$B$11=TRUE,\"Y\",\"N\")","v":"N"},{"$f":"IF(Worksheet!$B$12=TRUE,\"Y\",\"N\")","v":"N"},{"$f":"IF(Worksheet!$C$11=TRUE,\"Y\",\"N\")","v":"N"},{"$f":"IF(Worksheet!$C$12=TRUE,\"Y\",\"N\")","v":"N"},{"$f":"IFERROR(Worksheet!R18,\"\")","v":0}]
[{"$f":"IF(Worksheet!C19=\"LF\",252,IF(Worksheet!C19=\"LS\",252,IF(ISBLANK(Worksheet!O19)=FALSE,IF(ISBLANK(Worksheet!F19)=FALSE,IF(Worksheet!F19>50,88,87),87),\"\")))","v":""},{"$f":"IF(ISBLANK(Worksheet!D19) = FALSE,Worksheet!D19,\"\")","v":""},{"$f":"IF(ISBLANK(Worksheet!E19) = FALSE,Worksheet!E19,\"\")","v":""},{"$f":"IF(OR(Worksheet!C19=\"LF\",Worksheet!C19=\"LS\")=TRUE,Worksheet!N19,IF(Worksheet!F19=\"\",IF(Worksheet!G19=\"\",\"\",Worksheet!G19),Worksheet!F19))","v":""},{"$f":"IF(OR(Worksheet!C19=\"LF\",Worksheet!C19=\"LS\")=TRUE,\"GPM\",IF(Worksheet!F19=\"\",IF(Worksheet!G19=\"\",\"\",\"MBh\"),\"Gallons\"))","v":""},null,null,{"$f":"IF(Worksheet!Q19>0,Worksheet!Q19,\"\")","v":""},{"$f":"IF(ISBLANK(Worksheet!O19)=FALSE,Worksheet!O19,\"\")","v":""},{"$f":"IFERROR(Worksheet!Y19/I5,\"\")","v":""},{"$f":"IFERROR(Worksheet!AA19/I5,\"\")","v":""},{"$f":"IFERROR(Worksheet!AC19/I5,\"\")","v":""},{"$f":"IFERROR(IF(ISBLANK(Worksheet!U19)=FALSE, Worksheet!U19,\"\")/I5,0)","v":0},{"$f":"IFERROR(IF(ISBLANK(Worksheet!W19)=FALSE, Worksheet!W19,\"\")/I5,0)","v":0},{"$f":"IF(ISBLANK(Worksheet!H19)=FALSE, Worksheet!H19,\"\")","v":""},{"$f":"IF(ISBLANK(Worksheet!I19)=FALSE, Worksheet!I19,\"\")","v":""},null,{"$f":"IF(ISBLANK(Worksheet!P19)=FALSE,Worksheet!P19,\"\")","v":""},{"$f":"IF(Worksheet!$A$11=TRUE,\"Y\",\"N\")","v":"N"},{"$f":"IF(Worksheet!$A$12=TRUE,\"Y\",\"N\")","v":"N"},{"$f":"IF(Worksheet!$B$11=TRUE,\"Y\",\"N\")","v":"N"},{"$f":"IF(Worksheet!$B$12=TRUE,\"Y\",\"N\")","v":"N"},{"$f":"IF(Worksheet!$C$11=TRUE,\"Y\",\"N\")","v":"N"},{"$f":"IF(Worksheet!$C$12=TRUE,\"Y\",\"N\")","v":"N"},{"$f":"IFERROR(Worksheet!R19,\"\")","v":0}]
[{"$f":"IF(Worksheet!C20=\"LF\",252,IF(Worksheet!C20=\"LS\",252,IF(ISBLANK(Worksheet!O20)=FALSE,IF(ISBLANK(Worksheet!F20)=FALSE,IF(Worksheet!F20>50,88,87),87),\"\")))","v":""},{"$f":"IF(ISBLANK(Worksheet!D20) = FALSE,Worksheet!D20,\"\")","v":""},{"$f":"IF(ISBLANK(Worksheet!E20) = FALSE,Worksheet!E20,\"\")","v":""},{"$f":"IF(OR(Worksheet!C20=\"LF\",Worksheet!C20=\"LS\")=TRUE,Worksheet!N20,IF(Worksheet!F20=\"\",IF(Worksheet!G20=\"\",\"\",Worksheet!G20),Worksheet!F20))","v":""},{"$f":"IF(OR(Worksheet!C20=\"LF\",Worksheet!C20=\"LS\")=TRUE,\"GPM\",IF(Worksheet!F20=\"\",IF(Worksheet!G20=\"\",\"\",\"MBh\"),\"Gallons\"))","v":""},null,null,{"$f":"IF(Worksheet!Q20>0,Worksheet!Q20,\"\")","v":""},{"$f":"IF(ISBLANK(Worksheet!O20)=FALSE,Worksheet!O20,\"\")","v":""},{"$f":"IFERROR(Worksheet!Y20/I6,\"\")","v":""},{"$f":"IFERROR(Worksheet!AA20/I6,\"\")","v":""},{"$f":"IFERROR(Worksheet!AC20/I6,\"\")","v":""},{"$f":"IFERROR(IF(ISBLANK(Worksheet!U20)=FALSE, Worksheet!U20,\"\")/I6,0)","v":0},{"$f":"IFERROR(IF(ISBLANK(Worksheet!W20)=FALSE, Worksheet!W20,\"\")/I6,0)","v":0},{"$f":"IF(ISBLANK(Worksheet!H20)=FALSE, Worksheet!H20,\"\")","v":""},{"$f":"IF(ISBLANK(Worksheet!I20)=FALSE, Worksheet!I20,\"\")","v":""},null,{"$f":"IF(ISBLANK(Worksheet!P20)=FALSE,Worksheet!P20,\"\")","v":""},{"$f":"IF(Worksheet!$A$11=TRUE,\"Y\",\"N\")","v":"N"},{"$f":"IF(Worksheet!$A$12=TRUE,\"Y\",\"N\")","v":"N"},{"$f":"IF(Worksheet!$B$11=TRUE,\"Y\",\"N\")","v":"N"},{"$f":"IF(Worksheet!$B$12=TRUE,\"Y\",\"N\")","v":"N"},{"$f":"IF(Worksheet!$C$11=TRUE,\"Y\",\"N\")","v":"N"},{"$f":"IF(Worksheet!$C$12=TRUE,\"Y\",\"N\")","v":"N"},{"$f":"IFERROR(Worksheet!R20,\"\")","v":0}]
[{"$f":"IF(Worksheet!C21=\"LF\",252,IF(Worksheet!C21=\"LS\",252,IF(ISBLANK(Worksheet!O21)=FALSE,IF(ISBLANK(Worksheet!F21)=FALSE,IF(Worksheet!F21>50,88,87),87),\"\")))","v":""},{"$f":"IF(ISBLANK(Worksheet!D21) = FALSE,Worksheet!D21,\"\")","v":""},{"$f":"IF(ISBLANK(Worksheet!E21) = FALSE,Worksheet!E21,\"\")","v":""},{"$f":"IF(OR(Worksheet!C21=\"LF\",Worksheet!C21=\"LS\")=TRUE,Worksheet!N21,IF(Worksheet!F21=\"\",IF(Worksheet!G21=\"\",\"\",Worksheet!G21),Worksheet!F21))","v":""},{"$f":"IF(OR(Worksheet!C21=\"LF\",Worksheet!C21=\"LS\")=TRUE,\"GPM\",IF(Worksheet!F21=\"\",IF(Worksheet!G21=\"\",\"\",\"MBh\"),\"Gallons\"))","v":""},null,null,{"$f":"IF(Worksheet!Q21>0,Worksheet!Q21,\"\")","v":""},{"$f":"IF(ISBLANK(Worksheet!O21)=FALSE,Worksheet!O21,\"\")","v":""},{"$f":"IFERROR(Worksheet!Y21/I7,\"\")","v":""},{"$f":"IFERROR(Worksheet!AA21/I7,\"\")","v":""},{"$f":"IFERROR(Worksheet!AC21/I7,\"\")","v":""},{"$f":"IFERROR(IF(ISBLANK(Worksheet!U21)=FALSE, Worksheet!U21,\"\")/I7,0)","v":0},{"$f":"IFERROR(IF(ISBLANK(Worksheet!W21)=FALSE, Worksheet!W21,\"\")/I7,0)","v":0},{"$f":"IF(ISBLANK(Worksheet!H21)=FALSE, Worksheet!H21,\"\")","v":""},{"$f":"IF(ISBLANK(Worksheet!I21)=FALSE, Worksheet!I21,\"\")","v":""},null,{"$f":"IF(ISBLANK(Worksheet!P21)=FALSE,Worksheet!P21,\"\")","v":""},{"$f":"IF(Worksheet!$A$11=TRUE,\"Y\",\"N\")","v":"N"},{"$f":"IF(Worksheet!$A$12=TRUE,\"Y\",\"N\")","v":"N"},{"$f":"IF(Worksheet!$B$11=TRUE,\"Y\",\"N\")","v":"N"},{"$f":"IF(Worksheet!$B$12=TRUE,\"Y\",\"N\")","v":"N"},{"$f":"IF(Worksheet!$C$11=TRUE,\"Y\",\"N\")","v":"N"},{"$f":"IF(Worksheet!$C$12=TRUE,\"Y\",\"N\")","v":"N"},{"$f":"IFERROR(Worksheet!R21,\"\")","v":0}]
[{"$f":"IF(Worksheet!C22=\"LF\",252,IF(Worksheet!C22=\"LS\",252,IF(ISBLANK(Worksheet!O22)=FALSE,IF(ISBLANK(Worksheet!F22)=FALSE,IF(Worksheet!F22>50,88,87),87),\"\")))","v":""},{"$f":"IF(ISBLANK(Worksheet!D22) = FALSE,Worksheet!D22,\"\")","v":""},{"$f":"IF(ISBLANK(Worksheet!E22) = FALSE,Worksheet!E22,\"\")","v":""},{"$f":"IF(OR(Worksheet!C22=\"LF\",Worksheet!C22=\"LS\")=TRUE,Worksheet!N22,IF(Worksheet!F22=\"\",IF(Worksheet!G22=\"\",\"\",Worksheet!G22),Worksheet!F22))","v":""},{"$f":"IF(OR(Worksheet!C22=\"LF\",Worksheet!C22=\"LS\")=TRUE,\"GPM\",IF(Worksheet!F22=\"\",IF(Worksheet!G22=\"\",\"\",\"MBh\"),\"Gallons\"))","v":""},null,null,{"$f":"IF(Worksheet!Q22>0,Worksheet!Q22,\"\")","v":""},{"$f":"IF(ISBLANK(Worksheet!O22)=FALSE,Worksheet!O22,\"\")","v":""},{"$f":"IFERROR(Worksheet!Y22/I8,\"\")","v":""},{"$f":"IFERROR(Worksheet!AA22/I8,\"\")","v":""},{"$f":"IFERROR(Worksheet!AC22/I8,\"\")","v":""},{"$f":"IFERROR(IF(ISBLANK(Worksheet!U22)=FALSE, Worksheet!U22,\"\")/I8,0)","v":0},{"$f":"IFERROR(IF(ISBLANK(Worksheet!W22)=FALSE, Worksheet!W22,\"\")/I8,0)","v":0},{"$f":"IF(ISBLANK(Worksheet!H22)=FALSE, Worksheet!H22,\"\")","v":""},{"$f":"IF(ISBLANK(Worksheet!I22)=FALSE, Worksheet!I22,\"\")","v":""},null,{"$f":"IF(ISBLANK(Worksheet!P22)=FALSE,Worksheet!P22,\"\")","v":""},{"$f":"IF(Worksheet!$A$11=TRUE,\"Y\",\"N\")","v":"N"},{"$f":"IF(Worksheet!$A$12=TRUE,\"Y\",\"N\")","v":"N"},{"$f":"IF(Worksheet!$B$11=TRUE,\"Y\",\"N\")","v":"N"},{"$f":"IF(Worksheet!$B$12=TRUE,\"Y\",\"N\")","v":"N"},{"$f":"IF(Worksheet!$C$11=TRUE,\"Y\",\"N\")","v":"N"},{"$f":"IF(Worksheet!$C$12=TRUE,\"Y\",\"N\")","v":"N"},{"$f":"IFERROR(Worksheet!R22,\"\")","v":0}]
[{"$f":"IF(Worksheet!C23=\"LF\",252,IF(Worksheet!C23=\"LS\",252,IF(ISBLANK(Worksheet!O23)=FALSE,IF(ISBLANK(Worksheet!F23)=FALSE,IF(Worksheet!F23>50,88,87),87),\"\")))","v":""},{"$f":"IF(ISBLANK(Worksheet!D23) = FALSE,Worksheet!D23,\"\")","v":""},{"$f":"IF(ISBLANK(Worksheet!E23) = FALSE,Worksheet!E23,\"\")","v":""},{"$f":"IF(OR(Worksheet!C23=\"LF\",Worksheet!C23=\"LS\")=TRUE,Worksheet!N23,IF(Worksheet!F23=\"\",IF(Worksheet!G23=\"\",\"\",Worksheet!G23),Worksheet!F23))","v":""},{"$f":"IF(OR(Worksheet!C23=\"LF\",Worksheet!C23=\"LS\")=TRUE,\"GPM\",IF(Worksheet!F23=\"\",IF(Worksheet!G23=\"\",\"\",\"MBh\"),\"Gallons\"))","v":""},null,null,{"$f":"IF(Worksheet!Q23>0,Worksheet!Q23,\"\")","v":""},{"$f":"IF(ISBLANK(Worksheet!O23)=FALSE,Worksheet!O23,\"\")","v":""},{"$f":"IFERROR(Worksheet!Y23/I9,\"\")","v":""},{"$f":"IFERROR(Worksheet!AA23/I9,\"\")","v":""},{"$f":"IFERROR(Worksheet!AC23/I9,\"\")","v":""},{"$f":"IFERROR(IF(ISBLANK(Worksheet!U23)=FALSE, Worksheet!U23,\"\")/I9,0)","v":0},{"$f":"IFERROR(IF(ISBLANK(Worksheet!W23)=FALSE, Worksheet!W23,\"\")/I9,0)","v":0},{"$f":"IF(ISBLANK(Worksheet!H23)=FALSE, Worksheet!H23,\"\")","v":""},{"$f":"IF(ISBLANK(Worksheet!I23)=FALSE, Worksheet!I23,\"\")","v":""},null,{"$f":"IF(ISBLANK(Worksheet!P23)=FALSE,Worksheet!P23,\"\")","v":""},{"$f":"IF(Worksheet!$A$11=TRUE,\"Y\",\"N\")","v":"N"},{"$f":"IF(Worksheet!$A$12=TRUE,\"Y\",\"N\")","v":"N"},{"$f":"IF(Worksheet!$B$11=TRUE,\"Y\",\"N\")","v":"N"},{"$f":"IF(Worksheet!$B$12=TRUE,\"Y\",\"N\")","v":"N"},{"$f":"IF(Worksheet!$C$11=TRUE,\"Y\",\"N\")","v":"N"},{"$f":"IF(Worksheet!$C$12=TRUE,\"Y\",\"N\")","v":"N"},{"$f":"IFERROR(Worksheet!R23,\"\")","v":0}]
[{"$f":"IF(Worksheet!C24=\"LF\",252,IF(Worksheet!C24=\"LS\",252,IF(ISBLANK(Worksheet!O24)=FALSE,IF(ISBLANK(Worksheet!F24)=FALSE,IF(Worksheet!F24>50,88,87),87),\"\")))","v":""},{"$f":"IF(ISBLANK(Worksheet!D24) = FALSE,Worksheet!D24,\"\")","v":""},{"$f":"IF(ISBLANK(Worksheet!E24) = FALSE,Worksheet!E24,\"\")","v":""},{"$f":"IF(OR(Worksheet!C24=\"LF\",Worksheet!C24=\"LS\")=TRUE,Worksheet!N24,IF(Worksheet!F24=\"\",IF(Worksheet!G24=\"\",\"\",Worksheet!G24),Worksheet!F24))","v":""},{"$f":"IF(OR(Worksheet!C24=\"LF\",Worksheet!C24=\"LS\")=TRUE,\"GPM\",IF(Worksheet!F24=\"\",IF(Worksheet!G24=\"\",\"\",\"MBh\"),\"Gallons\"))","v":""},null,null,{"$f":"IF(Worksheet!Q24>0,Worksheet!Q24,\"\")","v":""},{"$f":"IF(ISBLANK(Worksheet!O24)=FALSE,Worksheet!O24,\"\")","v":""},{"$f":"IFERROR(Worksheet!Y24/I10,\"\")","v":""},{"$f":"IFERROR(Worksheet!AA24/I10,\"\")","v":""},{"$f":"IFERROR(Worksheet!AC24/I10,\"\")","v":""},{"$f":"IFERROR(IF(ISBLANK(Worksheet!U24)=FALSE, Worksheet!U24,\"\")/I10,0)","v":0},{"$f":"IFERROR(IF(ISBLANK(Worksheet!W24)=FALSE, Worksheet!W24,\"\")/I10,0)","v":0},{"$f":"IF(ISBLANK(Worksheet!H24)=FALSE, Worksheet!H24,\"\")","v":""},{"$f":"IF(ISBLANK(Worksheet!I24)=FALSE, Worksheet!I24,\"\")","v":""},null,{"$f":"IF(ISBLANK(Worksheet!P24)=FALSE,Worksheet!P24,\"\")","v":""},{"$f":"IF(Worksheet!$A$11=TRUE,\"Y\",\"N\")","v":"N"},{"$f":"IF(Worksheet!$A$12=TRUE,\"Y\",\"N\")","v":"N"},{"$f":"IF(Worksheet!$B$11=TRUE,\"Y\",\"N\")","v":"N"},{"$f":"IF(Worksheet!$B$12=TRUE,\"Y\",\"N\")","v":"N"},{"$f":"IF(Worksheet!$C$11=TRUE,\"Y\",\"N\")","v":"N"},{"$f":"IF(Worksheet!$C$12=TRUE,\"Y\",\"N\")","v":"N"},{"$f":"IFERROR(Worksheet!R24,\"\")","v":0}]
{"$rows_left_out":17}
{"sheet":"Version","index":4,"n_rows":14,"n_cols":3,"rows_kept":14,"cut":false,"hidden":true,"merged":[]}
[14,"<-Version"]
["Log"]
["2007-09-25",null,"Corrected incentive and savings calculation to account for difference between EF and AFUE units (fraction vs %)"]
["2007-10-02",null,"Added project information in rows 6-10"]
["2007-12-04",null,"Booster heater calculations added"]
["2008-01-08",null,"Corrected for new protocol and fixed faulty booster heater gas usage calculation"]
["2008-12-01",null,"Updated for compatability with measure tracking"]
["2011-09-30",null,"Updated gas savings calculation by removing quantity installed and commited from the calcualtion formula in \"worksheet\" tab and dividing commited quantity in \"Export\" tab in annual gas saving formula"]
["2012-01-13","V5","no change for 2012"]
["2012-07-11",null,"For tankless water heaters ,Added incentive for EF=82, before it was only >82"]
{"$rows_left_out":4}