{"text_format":"1","workbook":"xlsx","n_sheets":4,"sheets":["Worksheet","Measure Code","Export","Version"],"not_rendered":{"charts":0,"images":0,"macros":1,"external_links":1,"defined_names":13,"comments":0,"pivot_tables":0},"unopened":[],"bounds":{"document_bytes":16777216,"sheet_cells":100000,"rows_first":2000,"rows_last":500,"rows_between":2000,"halvings":0,"cell_chars":16384,"cell_head_chars":4096},"cells_cut":0,"cells_raw":0,"read":"whole","date_system":"1900"}

{"sheet":"Worksheet","index":0,"n_rows":93,"n_cols":23,"rows_kept":93,"cut":false,"hidden":false,"merged":[[0,0,0,3],[8,1,8,3],[7,1,7,3],[8,5,8,8],[7,5,7,8],[4,5,4,8],[3,5,3,8],[1,8,1,10],[0,8,0,10],[14,6,17,6],[14,7,17,7],[9,5,9,6],[14,5,17,5],[3,1,3,3],[5,1,5,3],[9,21,9,22],[9,19,9,20],[3,19,3,22],[4,19,7,22],[4,1,4,3],[14,0,17,0],[14,2,17,2],[14,3,17,3],[14,4,17,4],[14,1,17,1],[14,15,17,15],[14,16,17,16],[14,17,17,17],[14,18,17,18],[3,15,3,18],[4,15,7,18],[14,12,17,12],[14,13,17,13],[14,14,17,14],[14,11,17,11],[13,8,13,9],[14,8,17,8],[14,9,17,9],[14,10,17,10]]}
["FY22 SmartStart Existing Buildings - Refrigeration EC Motors v1.0",null,null,null,"Incentive amounts are estimates until verified by the Program Manager.",null,null,null,"Total Units Committed:",null,null,{"$f":"SUM(G19:G93)","v":0}]
[null,null,null,null,null,null,null,null,"Total Units Installed:",null,null,{"$f":"SUM(H19:H93)","v":0}]
["Customer Information"]
["Company",null,null,null,"Address",null,null,null,null,null,null,null,null,null,null,"Pre-Inspection Notes",null,null,null,"Post-Inspection Notes"]
["Application",null,null,null,"Date"]
["Contact"]
["Contractor/Vendor Information"]
["Company",null,null,null,"Address"]
["Contact",null,null,null,"Phone"]
["Enhanced Incentive Eligibility",null,null,null,null,null,null,null,null,null,null,null,null,null,null,null,null,null,null,"Inspection Type"]
[false,false,false]
[false,false,false]
[]
[null,null,null,null,null,null,null,null,"Totals:",null,{"$f":"SUM(K19:K93)","v":0},0,0,0,0,0,0,0]
["Measure Code","Reason\nN - New\nR - Replaced","Manufacturer","Model Number","Location","Size\n(HP)","Quantity Committed","Quantity Installed","Incentive Per Unit","Enhanced Incentive Per Unit","Total Committed Incentives","Total Installed Incentives","Demand Savings\nCommitted\nkW","Demand Savings\nCommitted\nkW","Annual Energy Savings\nCommitted\nkWh","Annual Energy Savings\nInstalled\nkWh","Lifetime Energy Savings\nCommitted\nkWh","LIfetime Energy Savings\nInstalled\nkWh","Savings at Full Load\nkW"]
[null,null,null,null,null,null,null,null,null,null,null,null,null,null,null,null,null,null,null,"FOUND PRE",null,"FOUND POST"]
[null,null,null,null,null,null,null,null,null,null,null,null,null,null,null,null,null,null,null,"(Type)","Count","(Type)","Count"]
[]
[null,null,null,null,null,null,null,null,{"$f":"IF(A19=\"RFM1\",40,0)","v":0},{"$f":"IF(OR($A$11=TRUE,$A$12=TRUE,$B$11=TRUE,$B$12=TRUE,$C$11=TRUE,$C$12=TRUE)=TRUE,I19,0)","v":0},{"$f":"G19*(I19+J19)","v":0},{"$f":"H19*(I19+J19)","v":0},{"$f":"IFERROR(S19*G19, 0)","v":0},{"$f":"IFERROR(S19*H19,0)","v":0},{"$f":"IFERROR(G19*S19*(0.25*8760+0.75*8500),0)","v":0},{"$f":"IFERROR(H19*S19*(0.25*8760+0.75*8500),0)","v":0},{"$f":"O19*15","v":0},{"$f":"P19*15","v":0},{"$f":"IF(A19=\"RFM1\",F19*(0.25*0.65+0.75*(0.25*0.29+0.75*0.53))*0.746*(1+0.28*1.6),0)","v":0}]
[null,null,null,null,null,null,null,null,{"$f":"IF(A20=\"RFM1\",40,0)","v":0},{"$f":"IF(OR($A$11=TRUE,$A$12=TRUE,$B$11=TRUE,$B$12=TRUE,$C$11=TRUE,$C$12=TRUE)=TRUE,I20,0)","v":0},{"$f":"G20*(I20+J20)","v":0},{"$f":"H20*(I20+J20)","v":0},0,0,0,0,{"$f":"O20*15","v":0},{"$f":"P20*15","v":0},0]
[null,null,null,null,null,null,null,null,0,0,0,0,0,0,0,0,0,0,0]
[null,null,null,null,null,null,null,null,0,0,0,0,0,0,0,0,0,0,0]
[null,null,null,null,null,null,null,null,0,0,0,0,0,0,0,0,0,0,0]
[null,null,null,null,null,null,null,null,0,0,0,0,0,0,0,0,0,0,0]
[null,null,null,null,null,null,null,null,0,0,0,0,0,0,0,0,0,0,0]
[null,null,null,null,null,null,null,null,0,0,0,0,0,0,0,0,0,0,0]
[null,null,null,null,null,null,null,null,0,0,0,0,0,0,0,0,0,0,0]
[null,null,null,null,null,null,null,null,0,0,0,0,0,0,0,0,0,0,0]
[null,null,null,null,null,null,null,null,0,0,0,0,0,0,0,0,0,0,0]
[null,null,null,null,null,null,null,null,0,0,0,0,0,0,0,0,0,0,0]
[null,null,null,null,null,null,null,null,0,0,0,0,0,0,0,0,0,0,0]
[null,null,null,null,null,null,null,null,0,0,0,0,0,0,0,0,0,0,0]
[null,null,null,null,null,null,null,null,0,0,0,0,0,0,0,0,0,0,0]
[null,null,null,null,null,null,null,null,0,0,0,0,0,0,0,0,0,0,0]
[null,null,null,null,null,null,null,null,0,0,0,0,0,0,0,0,0,0,0]
[null,null,null,null,null,null,null,null,0,0,0,0,0,0,0,0,0,0,0]
[null,null,null,null,null,null,null,null,0,0,0,0,0,0,0,0,0,0,0]
[null,null,null,null,null,null,null,null,0,0,0,0,0,0,0,0,0,0,0]
[null,null,null,null,null,null,null,null,0,0,0,0,0,0,0,0,0,0,0]
[null,null,null,null,null,null,null,null,0,0,0,0,0,0,0,0,0,0,0]
[null,null,null,null,null,null,null,null,0,0,0,0,0,0,0,0,0,0,0]
[null,null,null,null,null,null,null,null,0,0,0,0,0,0,0,0,0,0,0]
[null,null,null,null,null,null,null,null,0,0,0,0,0,0,0,0,0,0,0]
[null,null,null,null,null,null,null,null,0,0,0,0,0,0,0,0,0,0,0]
[null,null,null,null,null,null,null,null,0,0,0,0,0,0,0,0,0,0,0]
[null,null,null,null,null,null,null,null,0,0,0,0,0,0,0,0,0,0,0]
[null,null,null,null,null,null,null,null,0,0,0,0,0,0,0,0,0,0,0]
[null,null,null,null,null,null,null,null,0,0,0,0,0,0,0,0,0,0,0]
[null,null,null,null,null,null,null,null,0,0,0,0,0,0,0,0,0,0,0]
[null,null,null,null,null,null,null,null,0,0,0,0,0,0,0,0,0,0,0]
[null,null,null,null,null,null,null,null,0,0,0,0,{"$f":"IFERROR(S51*G51, 0)","v":0},{"$f":"IFERROR(S51*H51,0)","v":0},{"$f":"IFERROR(G51*S51*(0.25*8760+0.75*8500),0)","v":0},{"$f":"IFERROR(H51*S51*(0.25*8760+0.75*8500),0)","v":0},0,0,{"$f":"IF(A51=\"RFM1\",F51*(0.25*0.65+0.75*(0.25*0.29+0.75*0.53))*0.746*(1+0.28*1.6),0)","v":0}]
[null,null,null,null,null,null,null,null,0,0,0,0,0,0,0,0,0,0,0]
[null,null,null,null,null,null,null,null,0,0,0,0,0,0,0,0,0,0,0]
[null,null,null,null,null,null,null,null,0,0,0,0,0,0,0,0,0,0,0]
[null,null,null,null,null,null,null,null,0,0,0,0,0,0,0,0,0,0,0]
[null,null,null,null,null,null,null,null,0,0,0,0,0,0,0,0,0,0,0]
[null,null,null,null,null,null,null,null,0,0,0,0,0,0,0,0,0,0,0]
[null,null,null,null,null,null,null,null,0,0,0,0,0,0,0,0,0,0,0]
[null,null,null,null,null,null,null,null,0,0,0,0,0,0,0,0,0,0,0]
[null,null,null,null,null,null,null,null,0,0,0,0,0,0,0,0,0,0,0]
[null,null,null,null,null,null,null,null,0,0,0,0,0,0,0,0,0,0,0]
[null,null,null,null,null,null,null,null,0,0,0,0,0,0,0,0,0,0,0]
[null,null,null,null,null,null,null,null,0,0,0,0,0,0,0,0,0,0,0]
[null,null,null,null,null,null,null,null,0,0,0,0,0,0,0,0,0,0,0]
[null,null,null,null,null,null,null,null,0,0,0,0,0,0,0,0,0,0,0]
[null,null,null,null,null,null,null,null,0,0,0,0,0,0,0,0,0,0,0]
[null,null,null,null,null,null,null,null,0,0,0,0,0,0,0,0,0,0,0]
[null,null,null,null,null,null,null,null,0,0,0,0,0,0,0,0,0,0,0]
[null,null,null,null,null,null,null,null,0,0,0,0,0,0,0,0,0,0,0]
[null,null,null,null,null,null,null,null,0,0,0,0,0,0,0,0,0,0,0]
[null,null,null,null,null,null,null,null,0,0,0,0,0,0,0,0,0,0,0]
[null,null,null,null,null,null,null,null,0,0,0,0,0,0,0,0,0,0,0]
[null,null,null,null,null,null,null,null,0,0,0,0,0,0,0,0,0,0,0]
[null,null,null,null,null,null,null,null,0,0,0,0,0,0,0,0,0,0,0]
[null,null,null,null,null,null,null,null,0,0,0,0,0,0,0,0,0,0,0]
[null,null,null,null,null,null,null,null,0,0,0,0,0,0,0,0,0,0,0]
[null,null,null,null,null,null,null,null,0,0,0,0,0,0,0,0,0,0,0]
[null,null,null,null,null,null,null,null,0,0,0,0,0,0,0,0,0,0,0]
[null,null,null,null,null,null,null,null,0,0,0,0,0,0,0,0,0,0,0]
[null,null,null,null,null,null,null,null,0,0,0,0,0,0,0,0,0,0,0]
[null,null,null,null,null,null,null,null,0,0,0,0,0,0,0,0,0,0,0]
[null,null,null,null,null,null,null,null,0,0,0,0,0,0,0,0,0,0,0]
[null,null,null,null,null,null,null,null,0,0,0,0,{"$f":"IFERROR(S83*G83, 0)","v":0},{"$f":"IFERROR(S83*H83,0)","v":0},{"$f":"IFERROR(G83*S83*(0.25*8760+0.75*8500),0)","v":0},{"$f":"IFERROR(H83*S83*(0.25*8760+0.75*8500),0)","v":0},0,0,0]
[null,null,null,null,null,null,null,null,{"$f":"IF(A84=\"RFM1\",40,0)","v":0},{"$f":"IF(OR($A$11=TRUE,$A$12=TRUE,$B$11=TRUE,$B$12=TRUE,$C$11=TRUE,$C$12=TRUE)=TRUE,I84,0)","v":0},{"$f":"G84*(I84+J84)","v":0},{"$f":"H84*(I84+J84)","v":0},0,0,0,0,{"$f":"O84*15","v":0},{"$f":"P84*15","v":0},{"$f":"IF(A84=\"RFM1\",F84*(0.25*0.65+0.75*(0.25*0.29+0.75*0.53))*0.746*(1+0.28*1.6),0)","v":0}]
[null,null,null,null,null,null,null,null,0,0,0,0,0,0,0,0,0,0,0]
[null,null,null,null,null,null,null,null,0,0,0,0,0,0,0,0,0,0,0]
[null,null,null,null,null,null,null,null,0,0,0,0,0,0,0,0,0,0,0]
[null,null,null,null,null,null,null,null,0,0,0,0,0,0,0,0,0,0,0]
[null,null,null,null,null,null,null,null,0,0,0,0,0,0,0,0,0,0,0]
[null,null,null,null,null,null,null,null,0,0,0,0,0,0,0,0,0,0,0]
[null,null,null,null,null,null,null,null,0,0,0,0,0,0,0,0,0,0,0]
[null,null,null,null,null,null,null,null,0,0,0,0,0,0,0,0,0,0,0]
[null,null,null,null,null,null,null,null,0,0,0,0,0,0,0,0,0,0,0]

{"sheet":"Measure Code","index":1,"n_rows":2,"n_cols":3,"rows_kept":2,"cut":false,"hidden":true,"merged":[]}
["Measure Code","Description","Measure Type"]
["RFM1","< 1HP Electronic Commutated Motor (ECM)",331]

{"sheet":"Export","index":2,"n_rows":76,"n_cols":25,"rows_kept":76,"cut":false,"hidden":true,"merged":[]}
["Measure Type","Manufacturer","Model","Capacity/Size","Capacity/Size Units","EER Efficiency","SEER Efficiency","Incentive Per Unit","Quantity Committed","Annual Electricity Savings","Peak Demand Reduction","Lifetime Electricity Savings","Annual Gas Savings","Lifetime Gas Savings","Efficiency- other","Efficiency- other-type","Measure ID removed","Quantity Installed","Project in UEZ","Project in OZ","Municipality","K-12 School","County","Affordable Housing","Enhanced Incentive per Unit"]
[{"$f":"IF(ISBLANK(Worksheet!G19)=FALSE,331,\"\")","v":""},{"$f":"Worksheet!C19","v":0},{"$f":"Worksheet!D19","v":0},{"$f":"Worksheet!F19","v":0},"HP",null,null,{"$f":"Worksheet!I19","v":0},{"$f":"IF(ISBLANK(Worksheet!G19)=FALSE,Worksheet!G19,\"\")","v":""},{"$f":"IFERROR(IFERROR(Worksheet!O19/Worksheet!G19,Worksheet!P19/Worksheet!H19),\"\")","v":""},{"$f":"Worksheet!S19","v":0},{"$f":"IFERROR(J2*15,\"\")","v":""},null,null,null,null,null,{"$f":"IF(ISBLANK(Worksheet!H19)=FALSE,Worksheet!H19,\"\")","v":""},{"$f":"IF(Worksheet!$A$11=TRUE,\"Y\",\"N\")","v":"N"},{"$f":"IF(Worksheet!$A$12=TRUE,\"Y\",\"N\")","v":"N"},{"$f":"IF(Worksheet!$B$11=TRUE,\"Y\",\"N\")","v":"N"},{"$f":"IF(Worksheet!$B$12=TRUE,\"Y\",\"N\")","v":"N"},{"$f":"IF(Worksheet!$C$11=TRUE,\"Y\",\"N\")","v":"N"},{"$f":"IF(Worksheet!$C$12=TRUE,\"Y\",\"N\")","v":"N"},{"$f":"IFERROR(Worksheet!J19,\"\")","v":0}]
[{"$f":"IF(ISBLANK(Worksheet!G20)=FALSE,331,\"\")","v":""},{"$f":"Worksheet!C20","v":0},{"$f":"Worksheet!D20","v":0},{"$f":"Worksheet!F20","v":0},"HP",null,null,{"$f":"Worksheet!I20","v":0},{"$f":"IF(ISBLANK(Worksheet!G20)=FALSE,Worksheet!G20,\"\")","v":""},{"$f":"IFERROR(IFERROR(Worksheet!O20/Worksheet!G20,Worksheet!P20/Worksheet!H20),\"\")","v":""},{"$f":"Worksheet!S20","v":0},{"$f":"IFERROR(J3*15,\"\")","v":""},null,null,null,null,null,{"$f":"IF(ISBLANK(Worksheet!H20)=FALSE,Worksheet!H20,\"\")","v":""},{"$f":"IF(Worksheet!$A$11=TRUE,\"Y\",\"N\")","v":"N"},{"$f":"IF(Worksheet!$A$12=TRUE,\"Y\",\"N\")","v":"N"},{"$f":"IF(Worksheet!$B$11=TRUE,\"Y\",\"N\")","v":"N"},{"$f":"IF(Worksheet!$B$12=TRUE,\"Y\",\"N\")","v":"N"},{"$f":"IF(Worksheet!$C$11=TRUE,\"Y\",\"N\")","v":"N"},{"$f":"IF(Worksheet!$C$12=TRUE,\"Y\",\"N\")","v":"N"},{"$f":"IFERROR(Worksheet!J20,\"\")","v":0}]
[{"$f":"IF(ISBLANK(Worksheet!G21)=FALSE,331,\"\")","v":""},{"$f":"Worksheet!C21","v":0},{"$f":"Worksheet!D21","v":0},{"$f":"Worksheet!F21","v":0},"HP",null,null,{"$f":"Worksheet!I21","v":0},{"$f":"IF(ISBLANK(Worksheet!G21)=FALSE,Worksheet!G21,\"\")","v":""},{"$f":"IFERROR(IFERROR(Worksheet!O21/Worksheet!G21,Worksheet!P21/Worksheet!H21),\"\")","v":""},{"$f":"Worksheet!S21","v":0},"",null,null,null,null,null,{"$f":"IF(ISBLANK(Worksheet!H21)=FALSE,Worksheet!H21,\"\")","v":""},{"$f":"IF(Worksheet!$A$11=TRUE,\"Y\",\"N\")","v":"N"},{"$f":"IF(Worksheet!$A$12=TRUE,\"Y\",\"N\")","v":"N"},{"$f":"IF(Worksheet!$B$11=TRUE,\"Y\",\"N\")","v":"N"},{"$f":"IF(Worksheet!$B$12=TRUE,\"Y\",\"N\")","v":"N"},{"$f":"IF(Worksheet!$C$11=TRUE,\"Y\",\"N\")","v":"N"},{"$f":"IF(Worksheet!$C$12=TRUE,\"Y\",\"N\")","v":"N"},{"$f":"IFERROR(Worksheet!J21,\"\")","v":0}]
[{"$f":"IF(ISBLANK(Worksheet!G22)=FALSE,331,\"\")","v":""},{"$f":"Worksheet!C22","v":0},{"$f":"Worksheet!D22","v":0},{"$f":"Worksheet!F22","v":0},"HP",null,null,{"$f":"Worksheet!I22","v":0},{"$f":"IF(ISBLANK(Worksheet!G22)=FALSE,Worksheet!G22,\"\")","v":""},{"$f":"IFERROR(IFERROR(Worksheet!O22/Worksheet!G22,Worksheet!P22/Worksheet!H22),\"\")","v":""},{"$f":"Worksheet!S22","v":0},"",null,null,null,null,null,{"$f":"IF(ISBLANK(Worksheet!H22)=FALSE,Worksheet!H22,\"\")","v":""},{"$f":"IF(Worksheet!$A$11=TRUE,\"Y\",\"N\")","v":"N"},{"$f":"IF(Worksheet!$A$12=TRUE,\"Y\",\"N\")","v":"N"},{"$f":"IF(Worksheet!$B$11=TRUE,\"Y\",\"N\")","v":"N"},{"$f":"IF(Worksheet!$B$12=TRUE,\"Y\",\"N\")","v":"N"},{"$f":"IF(Worksheet!$C$11=TRUE,\"Y\",\"N\")","v":"N"},{"$f":"IF(Worksheet!$C$12=TRUE,\"Y\",\"N\")","v":"N"},{"$f":"IFERROR(Worksheet!J22,\"\")","v":0}]
[{"$f":"IF(ISBLANK(Worksheet!G23)=FALSE,331,\"\")","v":""},{"$f":"Worksheet!C23","v":0},{"$f":"Worksheet!D23","v":0},{"$f":"Worksheet!F23","v":0},"HP",null,null,{"$f":"Worksheet!I23","v":0},{"$f":"IF(ISBLANK(Worksheet!G23)=FALSE,Worksheet!G23,\"\")","v":""},{"$f":"IFERROR(IFERROR(Worksheet!O23/Worksheet!G23,Worksheet!P23/Worksheet!H23),\"\")","v":""},{"$f":"Worksheet!S23","v":0},"",null,null,null,null,null,{"$f":"IF(ISBLANK(Worksheet!H23)=FALSE,Worksheet!H23,\"\")","v":""},{"$f":"IF(Worksheet!$A$11=TRUE,\"Y\",\"N\")","v":"N"},{"$f":"IF(Worksheet!$A$12=TRUE,\"Y\",\"N\")","v":"N"},{"$f":"IF(Worksheet!$B$11=TRUE,\"Y\",\"N\")","v":"N"},{"$f":"IF(Worksheet!$B$12=TRUE,\"Y\",\"N\")","v":"N"},{"$f":"IF(Worksheet!$C$11=TRUE,\"Y\",\"N\")","v":"N"},{"$f":"IF(Worksheet!$C$12=TRUE,\"Y\",\"N\")","v":"N"},{"$f":"IFERROR(Worksheet!J23,\"\")","v":0}]
[{"$f":"IF(ISBLANK(Worksheet!G24)=FALSE,331,\"\")","v":""},{"$f":"Worksheet!C24","v":0},{"$f":"Worksheet!D24","v":0},{"$f":"Worksheet!F24","v":0},"HP",null,null,{"$f":"Worksheet!I24","v":0},{"$f":"IF(ISBLANK(Worksheet!G24)=FALSE,Worksheet!G24,\"\")","v":""},{"$f":"IFERROR(IFERROR(Worksheet!O24/Worksheet!G24,Worksheet!P24/Worksheet!H24),\"\")","v":""},{"$f":"Worksheet!S24","v":0},"",null,null,null,null,null,{"$f":"IF(ISBLANK(Worksheet!H24)=FALSE,Worksheet!H24,\"\")","v":""},{"$f":"IF(Worksheet!$A$11=TRUE,\"Y\",\"N\")","v":"N"},{"$f":"IF(Worksheet!$A$12=TRUE,\"Y\",\"N\")","v":"N"},{"$f":"IF(Worksheet!$B$11=TRUE,\"Y\",\"N\")","v":"N"},{"$f":"IF(Worksheet!$B$12=TRUE,\"Y\",\"N\")","v":"N"},{"$f":"IF(Worksheet!$C$11=TRUE,\"Y\",\"N\")","v":"N"},{"$f":"IF(Worksheet!$C$12=TRUE,\"Y\",\"N\")","v":"N"},{"$f":"IFERROR(Worksheet!J24,\"\")","v":0}]
[{"$f":"IF(ISBLANK(Worksheet!G25)=FALSE,331,\"\")","v":""},{"$f":"Worksheet!C25","v":0},{"$f":"Worksheet!D25","v":0},{"$f":"Worksheet!F25","v":0},"HP",null,null,{"$f":"Worksheet!I25","v":0},{"$f":"IF(ISBLANK(Worksheet!G25)=FALSE,Worksheet!G25,\"\")","v":""},{"$f":"IFERROR(IFERROR(Worksheet!O25/Worksheet!G25,Worksheet!P25/Worksheet!H25),\"\")","v":""},{"$f":"Worksheet!S25","v":0},"",null,null,null,null,null,{"$f":"IF(ISBLANK(Worksheet!H25)=FALSE,Worksheet!H25,\"\")","v":""},{"$f":"IF(Worksheet!$A$11=TRUE,\"Y\",\"N\")","v":"N"},{"$f":"IF(Worksheet!$A$12=TRUE,\"Y\",\"N\")","v":"N"},{"$f":"IF(Worksheet!$B$11=TRUE,\"Y\",\"N\")","v":"N"},{"$f":"IF(Worksheet!$B$12=TRUE,\"Y\",\"N\")","v":"N"},{"$f":"IF(Worksheet!$C$11=TRUE,\"Y\",\"N\")","v":"N"},{"$f":"IF(Worksheet!$C$12=TRUE,\"Y\",\"N\")","v":"N"},{"$f":"IFERROR(Worksheet!J25,\"\")","v":0}]
[{"$f":"IF(ISBLANK(Worksheet!G26)=FALSE,331,\"\")","v":""},{"$f":"Worksheet!C26","v":0},{"$f":"Worksheet!D26","v":0},{"$f":"Worksheet!F26","v":0},"HP",null,null,{"$f":"Worksheet!I26","v":0},{"$f":"IF(ISBLANK(Worksheet!G26)=FALSE,Worksheet!G26,\"\")","v":""},{"$f":"IFERROR(IFERROR(Worksheet!O26/Worksheet!G26,Worksheet!P26/Worksheet!H26),\"\")","v":""},{"$f":"Worksheet!S26","v":0},"",null,null,null,null,null,{"$f":"IF(ISBLANK(Worksheet!H26)=FALSE,Worksheet!H26,\"\")","v":""},{"$f":"IF(Worksheet!$A$11=TRUE,\"Y\",\"N\")","v":"N"},{"$f":"IF(Worksheet!$A$12=TRUE,\"Y\",\"N\")","v":"N"},{"$f":"IF(Worksheet!$B$11=TRUE,\"Y\",\"N\")","v":"N"},{"$f":"IF(Worksheet!$B$12=TRUE,\"Y\",\"N\")","v":"N"},{"$f":"IF(Worksheet!$C$11=TRUE,\"Y\",\"N\")","v":"N"},{"$f":"IF(Worksheet!$C$12=TRUE,\"Y\",\"N\")","v":"N"},{"$f":"IFERROR(Worksheet!J26,\"\")","v":0}]
[{"$f":"IF(ISBLANK(Worksheet!G27)=FALSE,331,\"\")","v":""},{"$f":"Worksheet!C27","v":0},{"$f":"Worksheet!D27","v":0},{"$f":"Worksheet!F27","v":0},"HP",null,null,{"$f":"Worksheet!I27","v":0},{"$f":"IF(ISBLANK(Worksheet!G27)=FALSE,Worksheet!G27,\"\")","v":""},{"$f":"IFERROR(IFERROR(Worksheet!O27/Worksheet!G27,Worksheet!P27/Worksheet!H27),\"\")","v":""},{"$f":"Worksheet!S27","v":0},"",null,null,null,null,null,{"$f":"IF(ISBLANK(Worksheet!H27)=FALSE,Worksheet!H27,\"\")","v":""},{"$f":"IF(Worksheet!$A$11=TRUE,\"Y\",\"N\")","v":"N"},{"$f":"IF(Worksheet!$A$12=TRUE,\"Y\",\"N\")","v":"N"},{"$f":"IF(Worksheet!$B$11=TRUE,\"Y\",\"N\")","v":"N"},{"$f":"IF(Worksheet!$B$12=TRUE,\"Y\",\"N\")","v":"N"},{"$f":"IF(Worksheet!$C$11=TRUE,\"Y\",\"N\")","v":"N"},{"$f":"IF(Worksheet!$C$12=TRUE,\"Y\",\"N\")","v":"N"},{"$f":"IFERROR(Worksheet!J27,\"\")","v":0}]
[{"$f":"IF(ISBLANK(Worksheet!G28)=FALSE,331,\"\")","v":""},{"$f":"Worksheet!C28","v":0},{"$f":"Worksheet!D28","v":0},{"$f":"Worksheet!F28","v":0},"HP",null,null,{"$f":"Worksheet!I28","v":0},{"$f":"IF(ISBLANK(Worksheet!G28)=FALSE,Worksheet!G28,\"\")","v":""},{"$f":"IFERROR(IFERROR(Worksheet!O28/Worksheet!G28,Worksheet!P28/Worksheet!H28),\"\")","v":""},{"$f":"Worksheet!S28","v":0},"",null,null,null,null,null,{"$f":"IF(ISBLANK(Worksheet!H28)=FALSE,Worksheet!H28,\"\")","v":""},{"$f":"IF(Worksheet!$A$11=TRUE,\"Y\",\"N\")","v":"N"},{"$f":"IF(Worksheet!$A$12=TRUE,\"Y\",\"N\")","v":"N"},{"$f":"IF(Worksheet!$B$11=TRUE,\"Y\",\"N\")","v":"N"},{"$f":"IF(Worksheet!$B$12=TRUE,\"Y\",\"N\")","v":"N"},{"$f":"IF(Worksheet!$C$11=TRUE,\"Y\",\"N\")","v":"N"},{"$f":"IF(Worksheet!$C$12=TRUE,\"Y\",\"N\")","v":"N"},{"$f":"IFERROR(Worksheet!J28,\"\")","v":0}]
[{"$f":"IF(ISBLANK(Worksheet!G29)=FALSE,331,\"\")","v":""},{"$f":"Worksheet!C29","v":0},{"$f":"Worksheet!D29","v":0},{"$f":"Worksheet!F29","v":0},"HP",null,null,{"$f":"Worksheet!I29","v":0},{"$f":"IF(ISBLANK(Worksheet!G29)=FALSE,Worksheet!G29,\"\")","v":""},{"$f":"IFERROR(IFERROR(Worksheet!O29/Worksheet!G29,Worksheet!P29/Worksheet!H29),\"\")","v":""},{"$f":"Worksheet!S29","v":0},"",null,null,null,null,null,{"$f":"IF(ISBLANK(Worksheet!H29)=FALSE,Worksheet!H29,\"\")","v":""},{"$f":"IF(Worksheet!$A$11=TRUE,\"Y\",\"N\")","v":"N"},{"$f":"IF(Worksheet!$A$12=TRUE,\"Y\",\"N\")","v":"N"},{"$f":"IF(Worksheet!$B$11=TRUE,\"Y\",\"N\")","v":"N"},{"$f":"IF(Worksheet!$B$12=TRUE,\"Y\",\"N\")","v":"N"},{"$f":"IF(Worksheet!$C$11=TRUE,\"Y\",\"N\")","v":"N"},{"$f":"IF(Worksheet!$C$12=TRUE,\"Y\",\"N\")","v":"N"},{"$f":"IFERROR(Worksheet!J29,\"\")","v":0}]
[{"$f":"IF(ISBLANK(Worksheet!G30)=FALSE,331,\"\")","v":""},{"$f":"Worksheet!C30","v":0},{"$f":"Worksheet!D30","v":0},{"$f":"Worksheet!F30","v":0},"HP",null,null,{"$f":"Worksheet!I30","v":0},{"$f":"IF(ISBLANK(Worksheet!G30)=FALSE,Worksheet!G30,\"\")","v":""},{"$f":"IFERROR(IFERROR(Worksheet!O30/Worksheet!G30,Worksheet!P30/Worksheet!H30),\"\")","v":""},{"$f":"Worksheet!S30","v":0},"",null,null,null,null,null,{"$f":"IF(ISBLANK(Worksheet!H30)=FALSE,Worksheet!H30,\"\")","v":""},{"$f":"IF(Worksheet!$A$11=TRUE,\"Y\",\"N\")","v":"N"},{"$f":"IF(Worksheet!$A$12=TRUE,\"Y\",\"N\")","v":"N"},{"$f":"IF(Worksheet!$B$11=TRUE,\"Y\",\"N\")","v":"N"},{"$f":"IF(Worksheet!$B$12=TRUE,\"Y\",\"N\")","v":"N"},{"$f":"IF(Worksheet!$C$11=TRUE,\"Y\",\"N\")","v":"N"},{"$f":"IF(Worksheet!$C$12=TRUE,\"Y\",\"N\")","v":"N"},{"$f":"IFERROR(Worksheet!J30,\"\")","v":0}]
[{"$f":"IF(ISBLANK(Worksheet!G31)=FALSE,331,\"\")","v":""},{"$f":"Worksheet!C31","v":0},{"$f":"Worksheet!D31","v":0},{"$f":"Worksheet!F31","v":0},"HP",null,null,{"$f":"Worksheet!I31","v":0},{"$f":"IF(ISBLANK(Worksheet!G31)=FALSE,Worksheet!G31,\"\")","v":""},{"$f":"IFERROR(IFERROR(Worksheet!O31/Worksheet!G31,Worksheet!P31/Worksheet!H31),\"\")","v":""},{"$f":"Worksheet!S31","v":0},"",null,null,null,null,null,{"$f":"IF(ISBLANK(Worksheet!H31)=FALSE,Worksheet!H31,\"\")","v":""},{"$f":"IF(Worksheet!$A$11=TRUE,\"Y\",\"N\")","v":"N"},{"$f":"IF(Worksheet!$A$12=TRUE,\"Y\",\"N\")","v":"N"},{"$f":"IF(Worksheet!$B$11=TRUE,\"Y\",\"N\")","v":"N"},{"$f":"IF(Worksheet!$B$12=TRUE,\"Y\",\"N\")","v":"N"},{"$f":"IF(Worksheet!$C$11=TRUE,\"Y\",\"N\")","v":"N"},{"$f":"IF(Worksheet!$C$12=TRUE,\"Y\",\"N\")","v":"N"},{"$f":"IFERROR(Worksheet!J31,\"\")","v":0}]
[{"$f":"IF(ISBLANK(Worksheet!G32)=FALSE,331,\"\")","v":""},{"$f":"Worksheet!C32","v":0},{"$f":"Worksheet!D32","v":0},{"$f":"Worksheet!F32","v":0},"HP",null,null,{"$f":"Worksheet!I32","v":0},{"$f":"IF(ISBLANK(Worksheet!G32)=FALSE,Worksheet!G32,\"\")","v":""},{"$f":"IFERROR(IFERROR(Worksheet!O32/Worksheet!G32,Worksheet!P32/Worksheet!H32),\"\")","v":""},{"$f":"Worksheet!S32","v":0},"",null,null,null,null,null,{"$f":"IF(ISBLANK(Worksheet!H32)=FALSE,Worksheet!H32,\"\")","v":""},{"$f":"IF(Worksheet!$A$11=TRUE,\"Y\",\"N\")","v":"N"},{"$f":"IF(Worksheet!$A$12=TRUE,\"Y\",\"N\")","v":"N"},{"$f":"IF(Worksheet!$B$11=TRUE,\"Y\",\"N\")","v":"N"},{"$f":"IF(Worksheet!$B$12=TRUE,\"Y\",\"N\")","v":"N"},{"$f":"IF(Worksheet!$C$11=TRUE,\"Y\",\"N\")","v":"N"},{"$f":"IF(Worksheet!$C$12=TRUE,\"Y\",\"N\")","v":"N"},{"$f":"IFERROR(Worksheet!J32,\"\")","v":0}]
[{"$f":"IF(ISBLANK(Worksheet!G33)=FALSE,331,\"\")","v":""},{"$f":"Worksheet!C33","v":0},{"$f":"Worksheet!D33","v":0},{"$f":"Worksheet!F33","v":0},"HP",null,null,{"$f":"Worksheet!I33","v":0},{"$f":"IF(ISBLANK(Worksheet!G33)=FALSE,Worksheet!G33,\"\")","v":""},{"$f":"IFERROR(IFERROR(Worksheet!O33/Worksheet!G33,Worksheet!P33/Worksheet!H33),\"\")","v":""},{"$f":"Worksheet!S33","v":0},"",null,null,null,null,null,{"$f":"IF(ISBLANK(Worksheet!H33)=FALSE,Worksheet!H33,\"\")","v":""},{"$f":"IF(Worksheet!$A$11=TRUE,\"Y\",\"N\")","v":"N"},{"$f":"IF(Worksheet!$A$12=TRUE,\"Y\",\"N\")","v":"N"},{"$f":"IF(Worksheet!$B$11=TRUE,\"Y\",\"N\")","v":"N"},{"$f":"IF(Worksheet!$B$12=TRUE,\"Y\",\"N\")","v":"N"},{"$f":"IF(Worksheet!$C$11=TRUE,\"Y\",\"N\")","v":"N"},{"$f":"IF(Worksheet!$C$12=TRUE,\"Y\",\"N\")","v":"N"},{"$f":"IFERROR(Worksheet!J33,\"\")","v":0}]
[{"$f":"IF(ISBLANK(Worksheet!G34)=FALSE,331,\"\")","v":""},{"$f":"Worksheet!C34","v":0},{"$f":"Worksheet!D34","v":0},{"$f":"Worksheet!F34","v":0},"HP",null,null,{"$f":"Worksheet!I34","v":0},{"$f":"IF(ISBLANK(Worksheet!G34)=FALSE,Worksheet!G34,\"\")","v":""},{"$f":"IFERROR(IFERROR(Worksheet!O34/Worksheet!G34,Worksheet!P34/Worksheet!H34),\"\")","v":""},{"$f":"Worksheet!S34","v":0},"",null,null,null,null,null,{"$f":"IF(ISBLANK(Worksheet!H34)=FALSE,Worksheet!H34,\"\")","v":""},{"$f":"IF(Worksheet!$A$11=TRUE,\"Y\",\"N\")","v":"N"},{"$f":"IF(Worksheet!$A$12=TRUE,\"Y\",\"N\")","v":"N"},{"$f":"IF(Worksheet!$B$11=TRUE,\"Y\",\"N\")","v":"N"},{"$f":"IF(Worksheet!$B$12=TRUE,\"Y\",\"N\")","v":"N"},{"$f":"IF(Worksheet!$C$11=TRUE,\"Y\",\"N\")","v":"N"},{"$f":"IF(Worksheet!$C$12=TRUE,\"Y\",\"N\")","v":"N"},{"$f":"IFERROR(Worksheet!J34,\"\")","v":0}]
[{"$f":"IF(ISBLANK(Worksheet!G35)=FALSE,331,\"\")","v":""},{"$f":"Worksheet!C35","v":0},{"$f":"Worksheet!D35","v":0},{"$f":"Worksheet!F35","v":0},"HP",null,null,{"$f":"Worksheet!I35","v":0},{"$f":"IF(ISBLANK(Worksheet!G35)=FALSE,Worksheet!G35,\"\")","v":""},{"$f":"IFERROR(IFERROR(Worksheet!O35/Worksheet!G35,Worksheet!P35/Worksheet!H35),\"\")","v":""},{"$f":"Worksheet!S35","v":0},"",null,null,null,null,null,{"$f":"IF(ISBLANK(Worksheet!H35)=FALSE,Worksheet!H35,\"\")","v":""},{"$f":"IF(Worksheet!$A$11=TRUE,\"Y\",\"N\")","v":"N"},{"$f":"IF(Worksheet!$A$12=TRUE,\"Y\",\"N\")","v":"N"},{"$f":"IF(Worksheet!$B$11=TRUE,\"Y\",\"N\")","v":"N"},{"$f":"IF(Worksheet!$B$12=TRUE,\"Y\",\"N\")","v":"N"},{"$f":"IF(Worksheet!$C$11=TRUE,\"Y\",\"N\")","v":"N"},{"$f":"IF(Worksheet!$C$12=TRUE,\"Y\",\"N\")","v":"N"},{"$f":"IFERROR(Worksheet!J35,\"\")","v":0}]
[{"$f":"IF(ISBLANK(Worksheet!G36)=FALSE,331,\"\")","v":""},{"$f":"Worksheet!C36","v":0},{"$f":"Worksheet!D36","v":0},{"$f":"Worksheet!F36","v":0},"HP",null,null,{"$f":"Worksheet!I36","v":0},{"$f":"IF(ISBLANK(Worksheet!G36)=FALSE,Worksheet!G36,\"\")","v":""},{"$f":"IFERROR(IFERROR(Worksheet!O36/Worksheet!G36,Worksheet!P36/Worksheet!H36),\"\")","v":""},{"$f":"Worksheet!S36","v":0},"",null,null,null,null,null,{"$f":"IF(ISBLANK(Worksheet!H36)=FALSE,Worksheet!H36,\"\")","v":""},{"$f":"IF(Worksheet!$A$11=TRUE,\"Y\",\"N\")","v":"N"},{"$f":"IF(Worksheet!$A$12=TRUE,\"Y\",\"N\")","v":"N"},{"$f":"IF(Worksheet!$B$11=TRUE,\"Y\",\"N\")","v":"N"},{"$f":"IF(Worksheet!$B$12=TRUE,\"Y\",\"N\")","v":"N"},{"$f":"IF(Worksheet!$C$11=TRUE,\"Y\",\"N\")","v":"N"},{"$f":"IF(Worksheet!$C$12=TRUE,\"Y\",\"N\")","v":"N"},{"$f":"IFERROR(Worksheet!J36,\"\")","v":0}]
[{"$f":"IF(ISBLANK(Worksheet!G37)=FALSE,331,\"\")","v":""},{"$f":"Worksheet!C37","v":0},{"$f":"Worksheet!D37","v":0},{"$f":"Worksheet!F37","v":0},"HP",null,null,{"$f":"Worksheet!I37","v":0},{"$f":"IF(ISBLANK(Worksheet!G37)=FALSE,Worksheet!G37,\"\")","v":""},{"$f":"IFERROR(IFERROR(Worksheet!O37/Worksheet!G37,Worksheet!P37/Worksheet!H37),\"\")","v":""},{"$f":"Worksheet!S37","v":0},"",null,null,null,null,null,{"$f":"IF(ISBLANK(Worksheet!H37)=FALSE,Worksheet!H37,\"\")","v":""},{"$f":"IF(Worksheet!$A$11=TRUE,\"Y\",\"N\")","v":"N"},{"$f":"IF(Worksheet!$A$12=TRUE,\"Y\",\"N\")","v":"N"},{"$f":"IF(Worksheet!$B$11=TRUE,\"Y\",\"N\")","v":"N"},{"$f":"IF(Worksheet!$B$12=TRUE,\"Y\",\"N\")","v":"N"},{"$f":"IF(Worksheet!$C$11=TRUE,\"Y\",\"N\")","v":"N"},{"$f":"IF(Worksheet!$C$12=TRUE,\"Y\",\"N\")","v":"N"},{"$f":"IFERROR(Worksheet!J37,\"\")","v":0}]
[{"$f":"IF(ISBLANK(Worksheet!G38)=FALSE,331,\"\")","v":""},{"$f":"Worksheet!C38","v":0},{"$f":"Worksheet!D38","v":0},{"$f":"Worksheet!F38","v":0},"HP",null,null,{"$f":"Worksheet!I38","v":0},{"$f":"IF(ISBLANK(Worksheet!G38)=FALSE,Worksheet!G38,\"\")","v":""},{"$f":"IFERROR(IFERROR(Worksheet!O38/Worksheet!G38,Worksheet!P38/Worksheet!H38),\"\")","v":""},{"$f":"Worksheet!S38","v":0},"",null,null,null,null,null,{"$f":"IF(ISBLANK(Worksheet!H38)=FALSE,Worksheet!H38,\"\")","v":""},{"$f":"IF(Worksheet!$A$11=TRUE,\"Y\",\"N\")","v":"N"},{"$f":"IF(Worksheet!$A$12=TRUE,\"Y\",\"N\")","v":"N"},{"$f":"IF(Worksheet!$B$11=TRUE,\"Y\",\"N\")","v":"N"},{"$f":"IF(Worksheet!$B$12=TRUE,\"Y\",\"N\")","v":"N"},{"$f":"IF(Worksheet!$C$11=TRUE,\"Y\",\"N\")","v":"N"},{"$f":"IF(Worksheet!$C$12=TRUE,\"Y\",\"N\")","v":"N"},{"$f":"IFERROR(Worksheet!J38,\"\")","v":0}]
[{"$f":"IF(ISBLANK(Worksheet!G39)=FALSE,331,\"\")","v":""},{"$f":"Worksheet!C39","v":0},{"$f":"Worksheet!D39","v":0},{"$f":"Worksheet!F39","v":0},"HP",null,null,{"$f":"Worksheet!I39","v":0},{"$f":"IF(ISBLANK(Worksheet!G39)=FALSE,Worksheet!G39,\"\")","v":""},{"$f":"IFERROR(IFERROR(Worksheet!O39/Worksheet!G39,Worksheet!P39/Worksheet!H39),\"\")","v":""},{"$f":"Worksheet!S39","v":0},"",null,null,null,null,null,{"$f":"IF(ISBLANK(Worksheet!H39)=FALSE,Worksheet!H39,\"\")","v":""},{"$f":"IF(Worksheet!$A$11=TRUE,\"Y\",\"N\")","v":"N"},{"$f":"IF(Worksheet!$A$12=TRUE,\"Y\",\"N\")","v":"N"},{"$f":"IF(Worksheet!$B$11=TRUE,\"Y\",\"N\")","v":"N"},{"$f":"IF(Worksheet!$B$12=TRUE,\"Y\",\"N\")","v":"N"},{"$f":"IF(Worksheet!$C$11=TRUE,\"Y\",\"N\")","v":"N"},{"$f":"IF(Worksheet!$C$12=TRUE,\"Y\",\"N\")","v":"N"},{"$f":"IFERROR(Worksheet!J39,\"\")","v":0}]
[{"$f":"IF(ISBLANK(Worksheet!G40)=FALSE,331,\"\")","v":""},{"$f":"Worksheet!C40","v":0},{"$f":"Worksheet!D40","v":0},{"$f":"Worksheet!F40","v":0},"HP",null,null,{"$f":"Worksheet!I40","v":0},{"$f":"IF(ISBLANK(Worksheet!G40)=FALSE,Worksheet!G40,\"\")","v":""},{"$f":"IFERROR(IFERROR(Worksheet!O40/Worksheet!G40,Worksheet!P40/Worksheet!H40),\"\")","v":""},{"$f":"Worksheet!S40","v":0},"",null,null,null,null,null,{"$f":"IF(ISBLANK(Worksheet!H40)=FALSE,Worksheet!H40,\"\")","v":""},{"$f":"IF(Worksheet!$A$11=TRUE,\"Y\",\"N\")","v":"N"},{"$f":"IF(Worksheet!$A$12=TRUE,\"Y\",\"N\")","v":"N"},{"$f":"IF(Worksheet!$B$11=TRUE,\"Y\",\"N\")","v":"N"},{"$f":"IF(Worksheet!$B$12=TRUE,\"Y\",\"N\")","v":"N"},{"$f":"IF(Worksheet!$C$11=TRUE,\"Y\",\"N\")","v":"N"},{"$f":"IF(Worksheet!$C$12=TRUE,\"Y\",\"N\")","v":"N"},{"$f":"IFERROR(Worksheet!J40,\"\")","v":0}]
[{"$f":"IF(ISBLANK(Worksheet!G41)=FALSE,331,\"\")","v":""},{"$f":"Worksheet!C41","v":0},{"$f":"Worksheet!D41","v":0},{"$f":"Worksheet!F41","v":0},"HP",null,null,{"$f":"Worksheet!I41","v":0},{"$f":"IF(ISBLANK(Worksheet!G41)=FALSE,Worksheet!G41,\"\")","v":""},{"$f":"IFERROR(IFERROR(Worksheet!O41/Worksheet!G41,Worksheet!P41/Worksheet!H41),\"\")","v":""},{"$f":"Worksheet!S41","v":0},"",null,null,null,null,null,{"$f":"IF(ISBLANK(Worksheet!H41)=FALSE,Worksheet!H41,\"\")","v":""},{"$f":"IF(Worksheet!$A$11=TRUE,\"Y\",\"N\")","v":"N"},{"$f":"IF(Worksheet!$A$12=TRUE,\"Y\",\"N\")","v":"N"},{"$f":"IF(Worksheet!$B$11=TRUE,\"Y\",\"N\")","v":"N"},{"$f":"IF(Worksheet!$B$12=TRUE,\"Y\",\"N\")","v":"N"},{"$f":"IF(Worksheet!$C$11=TRUE,\"Y\",\"N\")","v":"N"},{"$f":"IF(Worksheet!$C$12=TRUE,\"Y\",\"N\")","v":"N"},{"$f":"IFERROR(Worksheet!J41,\"\")","v":0}]
[{"$f":"IF(ISBLANK(Worksheet!G42)=FALSE,331,\"\")","v":""},{"$f":"Worksheet!C42","v":0},{"$f":"Worksheet!D42","v":0},{"$f":"Worksheet!F42","v":0},"HP",null,null,{"$f":"Worksheet!I42","v":0},{"$f":"IF(ISBLANK(Worksheet!G42)=FALSE,Worksheet!G42,\"\")","v":""},{"$f":"IFERROR(IFERROR(Worksheet!O42/Worksheet!G42,Worksheet!P42/Worksheet!H42),\"\")","v":""},{"$f":"Worksheet!S42","v":0},"",null,null,null,null,null,{"$f":"IF(ISBLANK(Worksheet!H42)=FALSE,Worksheet!H42,\"\")","v":""},{"$f":"IF(Worksheet!$A$11=TRUE,\"Y\",\"N\")","v":"N"},{"$f":"IF(Worksheet!$A$12=TRUE,\"Y\",\"N\")","v":"N"},{"$f":"IF(Worksheet!$B$11=TRUE,\"Y\",\"N\")","v":"N"},{"$f":"IF(Worksheet!$B$12=TRUE,\"Y\",\"N\")","v":"N"},{"$f":"IF(Worksheet!$C$11=TRUE,\"Y\",\"N\")","v":"N"},{"$f":"IF(Worksheet!$C$12=TRUE,\"Y\",\"N\")","v":"N"},{"$f":"IFERROR(Worksheet!J42,\"\")","v":0}]
[{"$f":"IF(ISBLANK(Worksheet!G43)=FALSE,331,\"\")","v":""},{"$f":"Worksheet!C43","v":0},{"$f":"Worksheet!D43","v":0},{"$f":"Worksheet!F43","v":0},"HP",null,null,{"$f":"Worksheet!I43","v":0},{"$f":"IF(ISBLANK(Worksheet!G43)=FALSE,Worksheet!G43,\"\")","v":""},{"$f":"IFERROR(IFERROR(Worksheet!O43/Worksheet!G43,Worksheet!P43/Worksheet!H43),\"\")","v":""},{"$f":"Worksheet!S43","v":0},"",null,null,null,null,null,{"$f":"IF(ISBLANK(Worksheet!H43)=FALSE,Worksheet!H43,\"\")","v":""},{"$f":"IF(Worksheet!$A$11=TRUE,\"Y\",\"N\")","v":"N"},{"$f":"IF(Worksheet!$A$12=TRUE,\"Y\",\"N\")","v":"N"},{"$f":"IF(Worksheet!$B$11=TRUE,\"Y\",\"N\")","v":"N"},{"$f":"IF(Worksheet!$B$12=TRUE,\"Y\",\"N\")","v":"N"},{"$f":"IF(Worksheet!$C$11=TRUE,\"Y\",\"N\")","v":"N"},{"$f":"IF(Worksheet!$C$12=TRUE,\"Y\",\"N\")","v":"N"},{"$f":"IFERROR(Worksheet!J43,\"\")","v":0}]
[{"$f":"IF(ISBLANK(Worksheet!G44)=FALSE,331,\"\")","v":""},{"$f":"Worksheet!C44","v":0},{"$f":"Worksheet!D44","v":0},{"$f":"Worksheet!F44","v":0},"HP",null,null,{"$f":"Worksheet!I44","v":0},{"$f":"IF(ISBLANK(Worksheet!G44)=FALSE,Worksheet!G44,\"\")","v":""},{"$f":"IFERROR(IFERROR(Worksheet!O44/Worksheet!G44,Worksheet!P44/Worksheet!H44),\"\")","v":""},{"$f":"Worksheet!S44","v":0},"",null,null,null,null,null,{"$f":"IF(ISBLANK(Worksheet!H44)=FALSE,Worksheet!H44,\"\")","v":""},{"$f":"IF(Worksheet!$A$11=TRUE,\"Y\",\"N\")","v":"N"},{"$f":"IF(Worksheet!$A$12=TRUE,\"Y\",\"N\")","v":"N"},{"$f":"IF(Worksheet!$B$11=TRUE,\"Y\",\"N\")","v":"N"},{"$f":"IF(Worksheet!$B$12=TRUE,\"Y\",\"N\")","v":"N"},{"$f":"IF(Worksheet!$C$11=TRUE,\"Y\",\"N\")","v":"N"},{"$f":"IF(Worksheet!$C$12=TRUE,\"Y\",\"N\")","v":"N"},{"$f":"IFERROR(Worksheet!J44,\"\")","v":0}]
[{"$f":"IF(ISBLANK(Worksheet!G45)=FALSE,331,\"\")","v":""},{"$f":"Worksheet!C45","v":0},{"$f":"Worksheet!D45","v":0},{"$f":"Worksheet!F45","v":0},"HP",null,null,{"$f":"Worksheet!I45","v":0},{"$f":"IF(ISBLANK(Worksheet!G45)=FALSE,Worksheet!G45,\"\")","v":""},{"$f":"IFERROR(IFERROR(Worksheet!O45/Worksheet!G45,Worksheet!P45/Worksheet!H45),\"\")","v":""},{"$f":"Worksheet!S45","v":0},"",null,null,null,null,null,{"$f":"IF(ISBLANK(Worksheet!H45)=FALSE,Worksheet!H45,\"\")","v":""},{"$f":"IF(Worksheet!$A$11=TRUE,\"Y\",\"N\")","v":"N"},{"$f":"IF(Worksheet!$A$12=TRUE,\"Y\",\"N\")","v":"N"},{"$f":"IF(Worksheet!$B$11=TRUE,\"Y\",\"N\")","v":"N"},{"$f":"IF(Worksheet!$B$12=TRUE,\"Y\",\"N\")","v":"N"},{"$f":"IF(Worksheet!$C$11=TRUE,\"Y\",\"N\")","v":"N"},{"$f":"IF(Worksheet!$C$12=TRUE,\"Y\",\"N\")","v":"N"},{"$f":"IFERROR(Worksheet!J45,\"\")","v":0}]
[{"$f":"IF(ISBLANK(Worksheet!G46)=FALSE,331,\"\")","v":""},{"$f":"Worksheet!C46","v":0},{"$f":"Worksheet!D46","v":0},{"$f":"Worksheet!F46","v":0},"HP",null,null,{"$f":"Worksheet!I46","v":0},{"$f":"IF(ISBLANK(Worksheet!G46)=FALSE,Worksheet!G46,\"\")","v":""},{"$f":"IFERROR(IFERROR(Worksheet!O46/Worksheet!G46,Worksheet!P46/Worksheet!H46),\"\")","v":""},{"$f":"Worksheet!S46","v":0},"",null,null,null,null,null,{"$f":"IF(ISBLANK(Worksheet!H46)=FALSE,Worksheet!H46,\"\")","v":""},{"$f":"IF(Worksheet!$A$11=TRUE,\"Y\",\"N\")","v":"N"},{"$f":"IF(Worksheet!$A$12=TRUE,\"Y\",\"N\")","v":"N"},{"$f":"IF(Worksheet!$B$11=TRUE,\"Y\",\"N\")","v":"N"},{"$f":"IF(Worksheet!$B$12=TRUE,\"Y\",\"N\")","v":"N"},{"$f":"IF(Worksheet!$C$11=TRUE,\"Y\",\"N\")","v":"N"},{"$f":"IF(Worksheet!$C$12=TRUE,\"Y\",\"N\")","v":"N"},{"$f":"IFERROR(Worksheet!J46,\"\")","v":0}]
[{"$f":"IF(ISBLANK(Worksheet!G47)=FALSE,331,\"\")","v":""},{"$f":"Worksheet!C47","v":0},{"$f":"Worksheet!D47","v":0},{"$f":"Worksheet!F47","v":0},"HP",null,null,{"$f":"Worksheet!I47","v":0},{"$f":"IF(ISBLANK(Worksheet!G47)=FALSE,Worksheet!G47,\"\")","v":""},{"$f":"IFERROR(IFERROR(Worksheet!O47/Worksheet!G47,Worksheet!P47/Worksheet!H47),\"\")","v":""},{"$f":"Worksheet!S47","v":0},"",null,null,null,null,null,{"$f":"IF(ISBLANK(Worksheet!H47)=FALSE,Worksheet!H47,\"\")","v":""},{"$f":"IF(Worksheet!$A$11=TRUE,\"Y\",\"N\")","v":"N"},{"$f":"IF(Worksheet!$A$12=TRUE,\"Y\",\"N\")","v":"N"},{"$f":"IF(Worksheet!$B$11=TRUE,\"Y\",\"N\")","v":"N"},{"$f":"IF(Worksheet!$B$12=TRUE,\"Y\",\"N\")","v":"N"},{"$f":"IF(Worksheet!$C$11=TRUE,\"Y\",\"N\")","v":"N"},{"$f":"IF(Worksheet!$C$12=TRUE,\"Y\",\"N\")","v":"N"},{"$f":"IFERROR(Worksheet!J47,\"\")","v":0}]
[{"$f":"IF(ISBLANK(Worksheet!G48)=FALSE,331,\"\")","v":""},{"$f":"Worksheet!C48","v":0},{"$f":"Worksheet!D48","v":0},{"$f":"Worksheet!F48","v":0},"HP",null,null,{"$f":"Worksheet!I48","v":0},{"$f":"IF(ISBLANK(Worksheet!G48)=FALSE,Worksheet!G48,\"\")","v":""},{"$f":"IFERROR(IFERROR(Worksheet!O48/Worksheet!G48,Worksheet!P48/Worksheet!H48),\"\")","v":""},{"$f":"Worksheet!S48","v":0},"",null,null,null,null,null,{"$f":"IF(ISBLANK(Worksheet!H48)=FALSE,Worksheet!H48,\"\")","v":""},{"$f":"IF(Worksheet!$A$11=TRUE,\"Y\",\"N\")","v":"N"},{"$f":"IF(Worksheet!$A$12=TRUE,\"Y\",\"N\")","v":"N"},{"$f":"IF(Worksheet!$B$11=TRUE,\"Y\",\"N\")","v":"N"},{"$f":"IF(Worksheet!$B$12=TRUE,\"Y\",\"N\")","v":"N"},{"$f":"IF(Worksheet!$C$11=TRUE,\"Y\",\"N\")","v":"N"},{"$f":"IF(Worksheet!$C$12=TRUE,\"Y\",\"N\")","v":"N"},{"$f":"IFERROR(Worksheet!J48,\"\")","v":0}]
[{"$f":"IF(ISBLANK(Worksheet!G49)=FALSE,331,\"\")","v":""},{"$f":"Worksheet!C49","v":0},{"$f":"Worksheet!D49","v":0},{"$f":"Worksheet!F49","v":0},"HP",null,null,{"$f":"Worksheet!I49","v":0},{"$f":"IF(ISBLANK(Worksheet!G49)=FALSE,Worksheet!G49,\"\")","v":""},{"$f":"IFERROR(IFERROR(Worksheet!O49/Worksheet!G49,Worksheet!P49/Worksheet!H49),\"\")","v":""},{"$f":"Worksheet!S49","v":0},"",null,null,null,null,null,{"$f":"IF(ISBLANK(Worksheet!H49)=FALSE,Worksheet!H49,\"\")","v":""},{"$f":"IF(Worksheet!$A$11=TRUE,\"Y\",\"N\")","v":"N"},{"$f":"IF(Worksheet!$A$12=TRUE,\"Y\",\"N\")","v":"N"},{"$f":"IF(Worksheet!$B$11=TRUE,\"Y\",\"N\")","v":"N"},{"$f":"IF(Worksheet!$B$12=TRUE,\"Y\",\"N\")","v":"N"},{"$f":"IF(Worksheet!$C$11=TRUE,\"Y\",\"N\")","v":"N"},{"$f":"IF(Worksheet!$C$12=TRUE,\"Y\",\"N\")","v":"N"},{"$f":"IFERROR(Worksheet!J49,\"\")","v":0}]
[{"$f":"IF(ISBLANK(Worksheet!G50)=FALSE,331,\"\")","v":""},{"$f":"Worksheet!C50","v":0},{"$f":"Worksheet!D50","v":0},{"$f":"Worksheet!F50","v":0},"HP",null,null,{"$f":"Worksheet!I50","v":0},{"$f":"IF(ISBLANK(Worksheet!G50)=FALSE,Worksheet!G50,\"\")","v":""},{"$f":"IFERROR(IFERROR(Worksheet!O50/Worksheet!G50,Worksheet!P50/Worksheet!H50),\"\")","v":""},{"$f":"Worksheet!S50","v":0},"",null,null,null,null,null,{"$f":"IF(ISBLANK(Worksheet!H50)=FALSE,Worksheet!H50,\"\")","v":""},{"$f":"IF(Worksheet!$A$11=TRUE,\"Y\",\"N\")","v":"N"},{"$f":"IF(Worksheet!$A$12=TRUE,\"Y\",\"N\")","v":"N"},{"$f":"IF(Worksheet!$B$11=TRUE,\"Y\",\"N\")","v":"N"},{"$f":"IF(Worksheet!$B$12=TRUE,\"Y\",\"N\")","v":"N"},{"$f":"IF(Worksheet!$C$11=TRUE,\"Y\",\"N\")","v":"N"},{"$f":"IF(Worksheet!$C$12=TRUE,\"Y\",\"N\")","v":"N"},{"$f":"IFERROR(Worksheet!J50,\"\")","v":0}]
[{"$f":"IF(ISBLANK(Worksheet!G51)=FALSE,331,\"\")","v":""},{"$f":"Worksheet!C51","v":0},{"$f":"Worksheet!D51","v":0},{"$f":"Worksheet!F51","v":0},"HP",null,null,{"$f":"Worksheet!I51","v":0},{"$f":"IF(ISBLANK(Worksheet!G51)=FALSE,Worksheet!G51,\"\")","v":""},{"$f":"IFERROR(IFERROR(Worksheet!O51/Worksheet!G51,Worksheet!P51/Worksheet!H51),\"\")","v":""},{"$f":"Worksheet!S51","v":0},"",null,null,null,null,null,{"$f":"IF(ISBLANK(Worksheet!H51)=FALSE,Worksheet!H51,\"\")","v":""},{"$f":"IF(Worksheet!$A$11=TRUE,\"Y\",\"N\")","v":"N"},{"$f":"IF(Worksheet!$A$12=TRUE,\"Y\",\"N\")","v":"N"},{"$f":"IF(Worksheet!$B$11=TRUE,\"Y\",\"N\")","v":"N"},{"$f":"IF(Worksheet!$B$12=TRUE,\"Y\",\"N\")","v":"N"},{"$f":"IF(Worksheet!$C$11=TRUE,\"Y\",\"N\")","v":"N"},{"$f":"IF(Worksheet!$C$12=TRUE,\"Y\",\"N\")","v":"N"},{"$f":"IFERROR(Worksheet!J51,\"\")","v":0}]
[{"$f":"IF(ISBLANK(Worksheet!G52)=FALSE,331,\"\")","v":""},{"$f":"Worksheet!C52","v":0},{"$f":"Worksheet!D52","v":0},{"$f":"Worksheet!F52","v":0},"HP",null,null,{"$f":"Worksheet!I52","v":0},{"$f":"IF(ISBLANK(Worksheet!G52)=FALSE,Worksheet!G52,\"\")","v":""},{"$f":"IFERROR(IFERROR(Worksheet!O52/Worksheet!G52,Worksheet!P52/Worksheet!H52),\"\")","v":""},{"$f":"Worksheet!S52","v":0},"",null,null,null,null,null,{"$f":"IF(ISBLANK(Worksheet!H52)=FALSE,Worksheet!H52,\"\")","v":""},{"$f":"IF(Worksheet!$A$11=TRUE,\"Y\",\"N\")","v":"N"},{"$f":"IF(Worksheet!$A$12=TRUE,\"Y\",\"N\")","v":"N"},{"$f":"IF(Worksheet!$B$11=TRUE,\"Y\",\"N\")","v":"N"},{"$f":"IF(Worksheet!$B$12=TRUE,\"Y\",\"N\")","v":"N"},{"$f":"IF(Worksheet!$C$11=TRUE,\"Y\",\"N\")","v":"N"},{"$f":"IF(Worksheet!$C$12=TRUE,\"Y\",\"N\")","v":"N"},{"$f":"IFERROR(Worksheet!J52,\"\")","v":0}]
[{"$f":"IF(ISBLANK(Worksheet!G53)=FALSE,331,\"\")","v":""},{"$f":"Worksheet!C53","v":0},{"$f":"Worksheet!D53","v":0},{"$f":"Worksheet!F53","v":0},"HP",null,null,{"$f":"Worksheet!I53","v":0},{"$f":"IF(ISBLANK(Worksheet!G53)=FALSE,Worksheet!G53,\"\")","v":""},{"$f":"IFERROR(IFERROR(Worksheet!O53/Worksheet!G53,Worksheet!P53/Worksheet!H53),\"\")","v":""},{"$f":"Worksheet!S53","v":0},"",null,null,null,null,null,{"$f":"IF(ISBLANK(Worksheet!H53)=FALSE,Worksheet!H53,\"\")","v":""},{"$f":"IF(Worksheet!$A$11=TRUE,\"Y\",\"N\")","v":"N"},{"$f":"IF(Worksheet!$A$12=TRUE,\"Y\",\"N\")","v":"N"},{"$f":"IF(Worksheet!$B$11=TRUE,\"Y\",\"N\")","v":"N"},{"$f":"IF(Worksheet!$B$12=TRUE,\"Y\",\"N\")","v":"N"},{"$f":"IF(Worksheet!$C$11=TRUE,\"Y\",\"N\")","v":"N"},{"$f":"IF(Worksheet!$C$12=TRUE,\"Y\",\"N\")","v":"N"},{"$f":"IFERROR(Worksheet!J53,\"\")","v":0}]
[{"$f":"IF(ISBLANK(Worksheet!G54)=FALSE,331,\"\")","v":""},{"$f":"Worksheet!C54","v":0},{"$f":"Worksheet!D54","v":0},{"$f":"Worksheet!F54","v":0},"HP",null,null,{"$f":"Worksheet!I54","v":0},{"$f":"IF(ISBLANK(Worksheet!G54)=FALSE,Worksheet!G54,\"\")","v":""},{"$f":"IFERROR(IFERROR(Worksheet!O54/Worksheet!G54,Worksheet!P54/Worksheet!H54),\"\")","v":""},{"$f":"Worksheet!S54","v":0},"",null,null,null,null,null,{"$f":"IF(ISBLANK(Worksheet!H54)=FALSE,Worksheet!H54,\"\")","v":""},{"$f":"IF(Worksheet!$A$11=TRUE,\"Y\",\"N\")","v":"N"},{"$f":"IF(Worksheet!$A$12=TRUE,\"Y\",\"N\")","v":"N"},{"$f":"IF(Worksheet!$B$11=TRUE,\"Y\",\"N\")","v":"N"},{"$f":"IF(Worksheet!$B$12=TRUE,\"Y\",\"N\")","v":"N"},{"$f":"IF(Worksheet!$C$11=TRUE,\"Y\",\"N\")","v":"N"},{"$f":"IF(Worksheet!$C$12=TRUE,\"Y\",\"N\")","v":"N"},{"$f":"IFERROR(Worksheet!J54,\"\")","v":0}]
[{"$f":"IF(ISBLANK(Worksheet!G55)=FALSE,331,\"\")","v":""},{"$f":"Worksheet!C55","v":0},{"$f":"Worksheet!D55","v":0},{"$f":"Worksheet!F55","v":0},"HP",null,null,{"$f":"Worksheet!I55","v":0},{"$f":"IF(ISBLANK(Worksheet!G55)=FALSE,Worksheet!G55,\"\")","v":""},{"$f":"IFERROR(IFERROR(Worksheet!O55/Worksheet!G55,Worksheet!P55/Worksheet!H55),\"\")","v":""},{"$f":"Worksheet!S55","v":0},"",null,null,null,null,null,{"$f":"IF(ISBLANK(Worksheet!H55)=FALSE,Worksheet!H55,\"\")","v":""},{"$f":"IF(Worksheet!$A$11=TRUE,\"Y\",\"N\")","v":"N"},{"$f":"IF(Worksheet!$A$12=TRUE,\"Y\",\"N\")","v":"N"},{"$f":"IF(Worksheet!$B$11=TRUE,\"Y\",\"N\")","v":"N"},{"$f":"IF(Worksheet!$B$12=TRUE,\"Y\",\"N\")","v":"N"},{"$f":"IF(Worksheet!$C$11=TRUE,\"Y\",\"N\")","v":"N"},{"$f":"IF(Worksheet!$C$12=TRUE,\"Y\",\"N\")","v":"N"},{"$f":"IFERROR(Worksheet!J55,\"\")","v":0}]
[{"$f":"IF(ISBLANK(Worksheet!G56)=FALSE,331,\"\")","v":""},{"$f":"Worksheet!C56","v":0},{"$f":"Worksheet!D56","v":0},{"$f":"Worksheet!F56","v":0},"HP",null,null,{"$f":"Worksheet!I56","v":0},{"$f":"IF(ISBLANK(Worksheet!G56)=FALSE,Worksheet!G56,\"\")","v":""},{"$f":"IFERROR(IFERROR(Worksheet!O56/Worksheet!G56,Worksheet!P56/Worksheet!H56),\"\")","v":""},{"$f":"Worksheet!S56","v":0},"",null,null,null,null,null,{"$f":"IF(ISBLANK(Worksheet!H56)=FALSE,Worksheet!H56,\"\")","v":""},{"$f":"IF(Worksheet!$A$11=TRUE,\"Y\",\"N\")","v":"N"},{"$f":"IF(Worksheet!$A$12=TRUE,\"Y\",\"N\")","v":"N"},{"$f":"IF(Worksheet!$B$11=TRUE,\"Y\",\"N\")","v":"N"},{"$f":"IF(Worksheet!$B$12=TRUE,\"Y\",\"N\")","v":"N"},{"$f":"IF(Worksheet!$C$11=TRUE,\"Y\",\"N\")","v":"N"},{"$f":"IF(Worksheet!$C$12=TRUE,\"Y\",\"N\")","v":"N"},{"$f":"IFERROR(Worksheet!J56,\"\")","v":0}]
[{"$f":"IF(ISBLANK(Worksheet!G57)=FALSE,331,\"\")","v":""},{"$f":"Worksheet!C57","v":0},{"$f":"Worksheet!D57","v":0},{"$f":"Worksheet!F57","v":0},"HP",null,null,{"$f":"Worksheet!I57","v":0},{"$f":"IF(ISBLANK(Worksheet!G57)=FALSE,Worksheet!G57,\"\")","v":""},{"$f":"IFERROR(IFERROR(Worksheet!O57/Worksheet!G57,Worksheet!P57/Worksheet!H57),\"\")","v":""},{"$f":"Worksheet!S57","v":0},"",null,null,null,null,null,{"$f":"IF(ISBLANK(Worksheet!H57)=FALSE,Worksheet!H57,\"\")","v":""},{"$f":"IF(Worksheet!$A$11=TRUE,\"Y\",\"N\")","v":"N"},{"$f":"IF(Worksheet!$A$12=TRUE,\"Y\",\"N\")","v":"N"},{"$f":"IF(Worksheet!$B$11=TRUE,\"Y\",\"N\")","v":"N"},{"$f":"IF(Worksheet!$B$12=TRUE,\"Y\",\"N\")","v":"N"},{"$f":"IF(Worksheet!$C$11=TRUE,\"Y\",\"N\")","v":"N"},{"$f":"IF(Worksheet!$C$12=TRUE,\"Y\",\"N\")","v":"N"},{"$f":"IFERROR(Worksheet!J57,\"\")","v":0}]
[{"$f":"IF(ISBLANK(Worksheet!G58)=FALSE,331,\"\")","v":""},{"$f":"Worksheet!C58","v":0},{"$f":"Worksheet!D58","v":0},{"$f":"Worksheet!F58","v":0},"HP",null,null,{"$f":"Worksheet!I58","v":0},{"$f":"IF(ISBLANK(Worksheet!G58)=FALSE,Worksheet!G58,\"\")","v":""},{"$f":"IFERROR(IFERROR(Worksheet!O58/Worksheet!G58,Worksheet!P58/Worksheet!H58),\"\")","v":""},{"$f":"Worksheet!S58","v":0},"",null,null,null,null,null,{"$f":"IF(ISBLANK(Worksheet!H58)=FALSE,Worksheet!H58,\"\")","v":""},{"$f":"IF(Worksheet!$A$11=TRUE,\"Y\",\"N\")","v":"N"},{"$f":"IF(Worksheet!$A$12=TRUE,\"Y\",\"N\")","v":"N"},{"$f":"IF(Worksheet!$B$11=TRUE,\"Y\",\"N\")","v":"N"},{"$f":"IF(Worksheet!$B$12=TRUE,\"Y\",\"N\")","v":"N"},{"$f":"IF(Worksheet!$C$11=TRUE,\"Y\",\"N\")","v":"N"},{"$f":"IF(Worksheet!$C$12=TRUE,\"Y\",\"N\")","v":"N"},{"$f":"IFERROR(Worksheet!J58,\"\")","v":0}]
[{"$f":"IF(ISBLANK(Worksheet!G59)=FALSE,331,\"\")","v":""},{"$f":"Worksheet!C59","v":0},{"$f":"Worksheet!D59","v":0},{"$f":"Worksheet!F59","v":0},"HP",null,null,{"$f":"Worksheet!I59","v":0},{"$f":"IF(ISBLANK(Worksheet!G59)=FALSE,Worksheet!G59,\"\")","v":""},{"$f":"IFERROR(IFERROR(Worksheet!O59/Worksheet!G59,Worksheet!P59/Worksheet!H59),\"\")","v":""},{"$f":"Worksheet!S59","v":0},"",null,null,null,null,null,{"$f":"IF(ISBLANK(Worksheet!H59)=FALSE,Worksheet!H59,\"\")","v":""},{"$f":"IF(Worksheet!$A$11=TRUE,\"Y\",\"N\")","v":"N"},{"$f":"IF(Worksheet!$A$12=TRUE,\"Y\",\"N\")","v":"N"},{"$f":"IF(Worksheet!$B$11=TRUE,\"Y\",\"N\")","v":"N"},{"$f":"IF(Worksheet!$B$12=TRUE,\"Y\",\"N\")","v":"N"},{"$f":"IF(Worksheet!$C$11=TRUE,\"Y\",\"N\")","v":"N"},{"$f":"IF(Worksheet!$C$12=TRUE,\"Y\",\"N\")","v":"N"},{"$f":"IFERROR(Worksheet!J59,\"\")","v":0}]
[{"$f":"IF(ISBLANK(Worksheet!G60)=FALSE,331,\"\")","v":""},{"$f":"Worksheet!C60","v":0},{"$f":"Worksheet!D60","v":0},{"$f":"Worksheet!F60","v":0},"HP",null,null,{"$f":"Worksheet!I60","v":0},{"$f":"IF(ISBLANK(Worksheet!G60)=FALSE,Worksheet!G60,\"\")","v":""},{"$f":"IFERROR(IFERROR(Worksheet!O60/Worksheet!G60,Worksheet!P60/Worksheet!H60),\"\")","v":""},{"$f":"Worksheet!S60","v":0},"",null,null,null,null,null,{"$f":"IF(ISBLANK(Worksheet!H60)=FALSE,Worksheet!H60,\"\")","v":""},{"$f":"IF(Worksheet!$A$11=TRUE,\"Y\",\"N\")","v":"N"},{"$f":"IF(Worksheet!$A$12=TRUE,\"Y\",\"N\")","v":"N"},{"$f":"IF(Worksheet!$B$11=TRUE,\"Y\",\"N\")","v":"N"},{"$f":"IF(Worksheet!$B$12=TRUE,\"Y\",\"N\")","v":"N"},{"$f":"IF(Worksheet!$C$11=TRUE,\"Y\",\"N\")","v":"N"},{"$f":"IF(Worksheet!$C$12=TRUE,\"Y\",\"N\")","v":"N"},{"$f":"IFERROR(Worksheet!J60,\"\")","v":0}]
[{"$f":"IF(ISBLANK(Worksheet!G61)=FALSE,331,\"\")","v":""},{"$f":"Worksheet!C61","v":0},{"$f":"Worksheet!D61","v":0},{"$f":"Worksheet!F61","v":0},"HP",null,null,{"$f":"Worksheet!I61","v":0},{"$f":"IF(ISBLANK(Worksheet!G61)=FALSE,Worksheet!G61,\"\")","v":""},{"$f":"IFERROR(IFERROR(Worksheet!O61/Worksheet!G61,Worksheet!P61/Worksheet!H61),\"\")","v":""},{"$f":"Worksheet!S61","v":0},"",null,null,null,null,null,{"$f":"IF(ISBLANK(Worksheet!H61)=FALSE,Worksheet!H61,\"\")","v":""},{"$f":"IF(Worksheet!$A$11=TRUE,\"Y\",\"N\")","v":"N"},{"$f":"IF(Worksheet!$A$12=TRUE,\"Y\",\"N\")","v":"N"},{"$f":"IF(Worksheet!$B$11=TRUE,\"Y\",\"N\")","v":"N"},{"$f":"IF(Worksheet!$B$12=TRUE,\"Y\",\"N\")","v":"N"},{"$f":"IF(Worksheet!$C$11=TRUE,\"Y\",\"N\")","v":"N"},{"$f":"IF(Worksheet!$C$12=TRUE,\"Y\",\"N\")","v":"N"},{"$f":"IFERROR(Worksheet!J61,\"\")","v":0}]
[{"$f":"IF(ISBLANK(Worksheet!G62)=FALSE,331,\"\")","v":""},{"$f":"Worksheet!C62","v":0},{"$f":"Worksheet!D62","v":0},{"$f":"Worksheet!F62","v":0},"HP",null,null,{"$f":"Worksheet!I62","v":0},{"$f":"IF(ISBLANK(Worksheet!G62)=FALSE,Worksheet!G62,\"\")","v":""},{"$f":"IFERROR(IFERROR(Worksheet!O62/Worksheet!G62,Worksheet!P62/Worksheet!H62),\"\")","v":""},{"$f":"Worksheet!S62","v":0},"",null,null,null,null,null,{"$f":"IF(ISBLANK(Worksheet!H62)=FALSE,Worksheet!H62,\"\")","v":""},{"$f":"IF(Worksheet!$A$11=TRUE,\"Y\",\"N\")","v":"N"},{"$f":"IF(Worksheet!$A$12=TRUE,\"Y\",\"N\")","v":"N"},{"$f":"IF(Worksheet!$B$11=TRUE,\"Y\",\"N\")","v":"N"},{"$f":"IF(Worksheet!$B$12=TRUE,\"Y\",\"N\")","v":"N"},{"$f":"IF(Worksheet!$C$11=TRUE,\"Y\",\"N\")","v":"N"},{"$f":"IF(Worksheet!$C$12=TRUE,\"Y\",\"N\")","v":"N"},{"$f":"IFERROR(Worksheet!J62,\"\")","v":0}]
[{"$f":"IF(ISBLANK(Worksheet!G63)=FALSE,331,\"\")","v":""},{"$f":"Worksheet!C63","v":0},{"$f":"Worksheet!D63","v":0},{"$f":"Worksheet!F63","v":0},"HP",null,null,{"$f":"Worksheet!I63","v":0},{"$f":"IF(ISBLANK(Worksheet!G63)=FALSE,Worksheet!G63,\"\")","v":""},{"$f":"IFERROR(IFERROR(Worksheet!O63/Worksheet!G63,Worksheet!P63/Worksheet!H63),\"\")","v":""},{"$f":"Worksheet!S63","v":0},"",null,null,null,null,null,{"$f":"IF(ISBLANK(Worksheet!H63)=FALSE,Worksheet!H63,\"\")","v":""},{"$f":"IF(Worksheet!$A$11=TRUE,\"Y\",\"N\")","v":"N"},{"$f":"IF(Worksheet!$A$12=TRUE,\"Y\",\"N\")","v":"N"},{"$f":"IF(Worksheet!$B$11=TRUE,\"Y\",\"N\")","v":"N"},{"$f":"IF(Worksheet!$B$12=TRUE,\"Y\",\"N\")","v":"N"},{"$f":"IF(Worksheet!$C$11=TRUE,\"Y\",\"N\")","v":"N"},{"$f":"IF(Worksheet!$C$12=TRUE,\"Y\",\"N\")","v":"N"},{"$f":"IFERROR(Worksheet!J63,\"\")","v":0}]
[{"$f":"IF(ISBLANK(Worksheet!G64)=FALSE,331,\"\")","v":""},{"$f":"Worksheet!C64","v":0},{"$f":"Worksheet!D64","v":0},{"$f":"Worksheet!F64","v":0},"HP",null,null,{"$f":"Worksheet!I64","v":0},{"$f":"IF(ISBLANK(Worksheet!G64)=FALSE,Worksheet!G64,\"\")","v":""},{"$f":"IFERROR(IFERROR(Worksheet!O64/Worksheet!G64,Worksheet!P64/Worksheet!H64),\"\")","v":""},{"$f":"Worksheet!S64","v":0},"",null,null,null,null,null,{"$f":"IF(ISBLANK(Worksheet!H64)=FALSE,Worksheet!H64,\"\")","v":""},{"$f":"IF(Worksheet!$A$11=TRUE,\"Y\",\"N\")","v":"N"},{"$f":"IF(Worksheet!$A$12=TRUE,\"Y\",\"N\")","v":"N"},{"$f":"IF(Worksheet!$B$11=TRUE,\"Y\",\"N\")","v":"N"},{"$f":"IF(Worksheet!$B$12=TRUE,\"Y\",\"N\")","v":"N"},{"$f":"IF(Worksheet!$C$11=TRUE,\"Y\",\"N\")","v":"N"},{"$f":"IF(Worksheet!$C$12=TRUE,\"Y\",\"N\")","v":"N"},{"$f":"IFERROR(Worksheet!J64,\"\")","v":0}]
[{"$f":"IF(ISBLANK(Worksheet!G65)=FALSE,331,\"\")","v":""},{"$f":"Worksheet!C65","v":0},{"$f":"Worksheet!D65","v":0},{"$f":"Worksheet!F65","v":0},"HP",null,null,{"$f":"Worksheet!I65","v":0},{"$f":"IF(ISBLANK(Worksheet!G65)=FALSE,Worksheet!G65,\"\")","v":""},{"$f":"IFERROR(IFERROR(Worksheet!O65/Worksheet!G65,Worksheet!P65/Worksheet!H65),\"\")","v":""},{"$f":"Worksheet!S65","v":0},"",null,null,null,null,null,{"$f":"IF(ISBLANK(Worksheet!H65)=FALSE,Worksheet!H65,\"\")","v":""},{"$f":"IF(Worksheet!$A$11=TRUE,\"Y\",\"N\")","v":"N"},{"$f":"IF(Worksheet!$A$12=TRUE,\"Y\",\"N\")","v":"N"},{"$f":"IF(Worksheet!$B$11=TRUE,\"Y\",\"N\")","v":"N"},{"$f":"IF(Worksheet!$B$12=TRUE,\"Y\",\"N\")","v":"N"},{"$f":"IF(Worksheet!$C$11=TRUE,\"Y\",\"N\")","v":"N"},{"$f":"IF(Worksheet!$C$12=TRUE,\"Y\",\"N\")","v":"N"},{"$f":"IFERROR(Worksheet!J65,\"\")","v":0}]
[{"$f":"IF(ISBLANK(Worksheet!G66)=FALSE,331,\"\")","v":""},{"$f":"Worksheet!C66","v":0},{"$f":"Worksheet!D66","v":0},{"$f":"Worksheet!F66","v":0},"HP",null,null,{"$f":"Worksheet!I66","v":0},{"$f":"IF(ISBLANK(Worksheet!G66)=FALSE,Worksheet!G66,\"\")","v":""},{"$f":"IFERROR(IFERROR(Worksheet!O66/Worksheet!G66,Worksheet!P66/Worksheet!H66),\"\")","v":""},{"$f":"Worksheet!S66","v":0},"",null,null,null,null,null,{"$f":"IF(ISBLANK(Worksheet!H66)=FALSE,Worksheet!H66,\"\")","v":""},{"$f":"IF(Worksheet!$A$11=TRUE,\"Y\",\"N\")","v":"N"},{"$f":"IF(Worksheet!$A$12=TRUE,\"Y\",\"N\")","v":"N"},{"$f":"IF(Worksheet!$B$11=TRUE,\"Y\",\"N\")","v":"N"},{"$f":"IF(Worksheet!$B$12=TRUE,\"Y\",\"N\")","v":"N"},{"$f":"IF(Worksheet!$C$11=TRUE,\"Y\",\"N\")","v":"N"},{"$f":"IF(Worksheet!$C$12=TRUE,\"Y\",\"N\")","v":"N"},{"$f":"IFERROR(Worksheet!J66,\"\")","v":0}]
[{"$f":"IF(ISBLANK(Worksheet!G67)=FALSE,331,\"\")","v":""},{"$f":"Worksheet!C67","v":0},{"$f":"Worksheet!D67","v":0},{"$f":"Worksheet!F67","v":0},"HP",null,null,{"$f":"Worksheet!I67","v":0},{"$f":"IF(ISBLANK(Worksheet!G67)=FALSE,Worksheet!G67,\"\")","v":""},{"$f":"IFERROR(IFERROR(Worksheet!O67/Worksheet!G67,Worksheet!P67/Worksheet!H67),\"\")","v":""},{"$f":"Worksheet!S67","v":0},"",null,null,null,null,null,{"$f":"IF(ISBLANK(Worksheet!H67)=FALSE,Worksheet!H67,\"\")","v":""},{"$f":"IF(Worksheet!$A$11=TRUE,\"Y\",\"N\")","v":"N"},{"$f":"IF(Worksheet!$A$12=TRUE,\"Y\",\"N\")","v":"N"},{"$f":"IF(Worksheet!$B$11=TRUE,\"Y\",\"N\")","v":"N"},{"$f":"IF(Worksheet!$B$12=TRUE,\"Y\",\"N\")","v":"N"},{"$f":"IF(Worksheet!$C$11=TRUE,\"Y\",\"N\")","v":"N"},{"$f":"IF(Worksheet!$C$12=TRUE,\"Y\",\"N\")","v":"N"},{"$f":"IFERROR(Worksheet!J67,\"\")","v":0}]
[{"$f":"IF(ISBLANK(Worksheet!G68)=FALSE,331,\"\")","v":""},{"$f":"Worksheet!C68","v":0},{"$f":"Worksheet!D68","v":0},{"$f":"Worksheet!F68","v":0},"HP",null,null,{"$f":"Worksheet!I68","v":0},{"$f":"IF(ISBLANK(Worksheet!G68)=FALSE,Worksheet!G68,\"\")","v":""},{"$f":"IFERROR(IFERROR(Worksheet!O68/Worksheet!G68,Worksheet!P68/Worksheet!H68),\"\")","v":""},{"$f":"Worksheet!S68","v":0},"",null,null,null,null,null,{"$f":"IF(ISBLANK(Worksheet!H68)=FALSE,Worksheet!H68,\"\")","v":""},{"$f":"IF(Worksheet!$A$11=TRUE,\"Y\",\"N\")","v":"N"},{"$f":"IF(Worksheet!$A$12=TRUE,\"Y\",\"N\")","v":"N"},{"$f":"IF(Worksheet!$B$11=TRUE,\"Y\",\"N\")","v":"N"},{"$f":"IF(Worksheet!$B$12=TRUE,\"Y\",\"N\")","v":"N"},{"$f":"IF(Worksheet!$C$11=TRUE,\"Y\",\"N\")","v":"N"},{"$f":"IF(Worksheet!$C$12=TRUE,\"Y\",\"N\")","v":"N"},{"$f":"IFERROR(Worksheet!J68,\"\")","v":0}]
[{"$f":"IF(ISBLANK(Worksheet!G69)=FALSE,331,\"\")","v":""},{"$f":"Worksheet!C69","v":0},{"$f":"Worksheet!D69","v":0},{"$f":"Worksheet!F69","v":0},"HP",null,null,{"$f":"Worksheet!I69","v":0},{"$f":"IF(ISBLANK(Worksheet!G69)=FALSE,Worksheet!G69,\"\")","v":""},{"$f":"IFERROR(IFERROR(Worksheet!O69/Worksheet!G69,Worksheet!P69/Worksheet!H69),\"\")","v":""},{"$f":"Worksheet!S69","v":0},"",null,null,null,null,null,{"$f":"IF(ISBLANK(Worksheet!H69)=FALSE,Worksheet!H69,\"\")","v":""},{"$f":"IF(Worksheet!$A$11=TRUE,\"Y\",\"N\")","v":"N"},{"$f":"IF(Worksheet!$A$12=TRUE,\"Y\",\"N\")","v":"N"},{"$f":"IF(Worksheet!$B$11=TRUE,\"Y\",\"N\")","v":"N"},{"$f":"IF(Worksheet!$B$12=TRUE,\"Y\",\"N\")","v":"N"},{"$f":"IF(Worksheet!$C$11=TRUE,\"Y\",\"N\")","v":"N"},{"$f":"IF(Worksheet!$C$12=TRUE,\"Y\",\"N\")","v":"N"},{"$f":"IFERROR(Worksheet!J69,\"\")","v":0}]
[{"$f":"IF(ISBLANK(Worksheet!G70)=FALSE,331,\"\")","v":""},{"$f":"Worksheet!C70","v":0},{"$f":"Worksheet!D70","v":0},{"$f":"Worksheet!F70","v":0},"HP",null,null,{"$f":"Worksheet!I70","v":0},{"$f":"IF(ISBLANK(Worksheet!G70)=FALSE,Worksheet!G70,\"\")","v":""},{"$f":"IFERROR(IFERROR(Worksheet!O70/Worksheet!G70,Worksheet!P70/Worksheet!H70),\"\")","v":""},{"$f":"Worksheet!S70","v":0},"",null,null,null,null,null,{"$f":"IF(ISBLANK(Worksheet!H70)=FALSE,Worksheet!H70,\"\")","v":""},{"$f":"IF(Worksheet!$A$11=TRUE,\"Y\",\"N\")","v":"N"},{"$f":"IF(Worksheet!$A$12=TRUE,\"Y\",\"N\")","v":"N"},{"$f":"IF(Worksheet!$B$11=TRUE,\"Y\",\"N\")","v":"N"},{"$f":"IF(Worksheet!$B$12=TRUE,\"Y\",\"N\")","v":"N"},{"$f":"IF(Worksheet!$C$11=TRUE,\"Y\",\"N\")","v":"N"},{"$f":"IF(Worksheet!$C$12=TRUE,\"Y\",\"N\")","v":"N"},{"$f":"IFERROR(Worksheet!J70,\"\")","v":0}]
[{"$f":"IF(ISBLANK(Worksheet!G71)=FALSE,331,\"\")","v":""},{"$f":"Worksheet!C71","v":0},{"$f":"Worksheet!D71","v":0},{"$f":"Worksheet!F71","v":0},"HP",null,null,{"$f":"Worksheet!I71","v":0},{"$f":"IF(ISBLANK(Worksheet!G71)=FALSE,Worksheet!G71,\"\")","v":""},{"$f":"IFERROR(IFERROR(Worksheet!O71/Worksheet!G71,Worksheet!P71/Worksheet!H71),\"\")","v":""},{"$f":"Worksheet!S71","v":0},"",null,null,null,null,null,{"$f":"IF(ISBLANK(Worksheet!H71)=FALSE,Worksheet!H71,\"\")","v":""},{"$f":"IF(Worksheet!$A$11=TRUE,\"Y\",\"N\")","v":"N"},{"$f":"IF(Worksheet!$A$12=TRUE,\"Y\",\"N\")","v":"N"},{"$f":"IF(Worksheet!$B$11=TRUE,\"Y\",\"N\")","v":"N"},{"$f":"IF(Worksheet!$B$12=TRUE,\"Y\",\"N\")","v":"N"},{"$f":"IF(Worksheet!$C$11=TRUE,\"Y\",\"N\")","v":"N"},{"$f":"IF(Worksheet!$C$12=TRUE,\"Y\",\"N\")","v":"N"},{"$f":"IFERROR(Worksheet!J71,\"\")","v":0}]
[{"$f":"IF(ISBLANK(Worksheet!G72)=FALSE,331,\"\")","v":""},{"$f":"Worksheet!C72","v":0},{"$f":"Worksheet!D72","v":0},{"$f":"Worksheet!F72","v":0},"HP",null,null,{"$f":"Worksheet!I72","v":0},{"$f":"IF(ISBLANK(Worksheet!G72)=FALSE,Worksheet!G72,\"\")","v":""},{"$f":"IFERROR(IFERROR(Worksheet!O72/Worksheet!G72,Worksheet!P72/Worksheet!H72),\"\")","v":""},{"$f":"Worksheet!S72","v":0},"",null,null,null,null,null,{"$f":"IF(ISBLANK(Worksheet!H72)=FALSE,Worksheet!H72,\"\")","v":""},{"$f":"IF(Worksheet!$A$11=TRUE,\"Y\",\"N\")","v":"N"},{"$f":"IF(Worksheet!$A$12=TRUE,\"Y\",\"N\")","v":"N"},{"$f":"IF(Worksheet!$B$11=TRUE,\"Y\",\"N\")","v":"N"},{"$f":"IF(Worksheet!$B$12=TRUE,\"Y\",\"N\")","v":"N"},{"$f":"IF(Worksheet!$C$11=TRUE,\"Y\",\"N\")","v":"N"},{"$f":"IF(Worksheet!$C$12=TRUE,\"Y\",\"N\")","v":"N"},{"$f":"IFERROR(Worksheet!J72,\"\")","v":0}]
[{"$f":"IF(ISBLANK(Worksheet!G73)=FALSE,331,\"\")","v":""},{"$f":"Worksheet!C73","v":0},{"$f":"Worksheet!D73","v":0},{"$f":"Worksheet!F73","v":0},"HP",null,null,{"$f":"Worksheet!I73","v":0},{"$f":"IF(ISBLANK(Worksheet!G73)=FALSE,Worksheet!G73,\"\")","v":""},{"$f":"IFERROR(IFERROR(Worksheet!O73/Worksheet!G73,Worksheet!P73/Worksheet!H73),\"\")","v":""},{"$f":"Worksheet!S73","v":0},"",null,null,null,null,null,{"$f":"IF(ISBLANK(Worksheet!H73)=FALSE,Worksheet!H73,\"\")","v":""},{"$f":"IF(Worksheet!$A$11=TRUE,\"Y\",\"N\")","v":"N"},{"$f":"IF(Worksheet!$A$12=TRUE,\"Y\",\"N\")","v":"N"},{"$f":"IF(Worksheet!$B$11=TRUE,\"Y\",\"N\")","v":"N"},{"$f":"IF(Worksheet!$B$12=TRUE,\"Y\",\"N\")","v":"N"},{"$f":"IF(Worksheet!$C$11=TRUE,\"Y\",\"N\")","v":"N"},{"$f":"IF(Worksheet!$C$12=TRUE,\"Y\",\"N\")","v":"N"},{"$f":"IFERROR(Worksheet!J73,\"\")","v":0}]
[{"$f":"IF(ISBLANK(Worksheet!G74)=FALSE,331,\"\")","v":""},{"$f":"Worksheet!C74","v":0},{"$f":"Worksheet!D74","v":0},{"$f":"Worksheet!F74","v":0},"HP",null,null,{"$f":"Worksheet!I74","v":0},{"$f":"IF(ISBLANK(Worksheet!G74)=FALSE,Worksheet!G74,\"\")","v":""},{"$f":"IFERROR(IFERROR(Worksheet!O74/Worksheet!G74,Worksheet!P74/Worksheet!H74),\"\")","v":""},{"$f":"Worksheet!S74","v":0},"",null,null,null,null,null,{"$f":"IF(ISBLANK(Worksheet!H74)=FALSE,Worksheet!H74,\"\")","v":""},{"$f":"IF(Worksheet!$A$11=TRUE,\"Y\",\"N\")","v":"N"},{"$f":"IF(Worksheet!$A$12=TRUE,\"Y\",\"N\")","v":"N"},{"$f":"IF(Worksheet!$B$11=TRUE,\"Y\",\"N\")","v":"N"},{"$f":"IF(Worksheet!$B$12=TRUE,\"Y\",\"N\")","v":"N"},{"$f":"IF(Worksheet!$C$11=TRUE,\"Y\",\"N\")","v":"N"},{"$f":"IF(Worksheet!$C$12=TRUE,\"Y\",\"N\")","v":"N"},{"$f":"IFERROR(Worksheet!J74,\"\")","v":0}]
[{"$f":"IF(ISBLANK(Worksheet!G75)=FALSE,331,\"\")","v":""},{"$f":"Worksheet!C75","v":0},{"$f":"Worksheet!D75","v":0},{"$f":"Worksheet!F75","v":0},"HP",null,null,{"$f":"Worksheet!I75","v":0},{"$f":"IF(ISBLANK(Worksheet!G75)=FALSE,Worksheet!G75,\"\")","v":""},{"$f":"IFERROR(IFERROR(Worksheet!O75/Worksheet!G75,Worksheet!P75/Worksheet!H75),\"\")","v":""},{"$f":"Worksheet!S75","v":0},"",null,null,null,null,null,{"$f":"IF(ISBLANK(Worksheet!H75)=FALSE,Worksheet!H75,\"\")","v":""},{"$f":"IF(Worksheet!$A$11=TRUE,\"Y\",\"N\")","v":"N"},{"$f":"IF(Worksheet!$A$12=TRUE,\"Y\",\"N\")","v":"N"},{"$f":"IF(Worksheet!$B$11=TRUE,\"Y\",\"N\")","v":"N"},{"$f":"IF(Worksheet!$B$12=TRUE,\"Y\",\"N\")","v":"N"},{"$f":"IF(Worksheet!$C$11=TRUE,\"Y\",\"N\")","v":"N"},{"$f":"IF(Worksheet!$C$12=TRUE,\"Y\",\"N\")","v":"N"},{"$f":"IFERROR(Worksheet!J75,\"\")","v":0}]
[{"$f":"IF(ISBLANK(Worksheet!G76)=FALSE,331,\"\")","v":""},{"$f":"Worksheet!C76","v":0},{"$f":"Worksheet!D76","v":0},{"$f":"Worksheet!F76","v":0},"HP",null,null,{"$f":"Worksheet!I76","v":0},{"$f":"IF(ISBLANK(Worksheet!G76)=FALSE,Worksheet!G76,\"\")","v":""},{"$f":"IFERROR(IFERROR(Worksheet!O76/Worksheet!G76,Worksheet!P76/Worksheet!H76),\"\")","v":""},{"$f":"Worksheet!S76","v":0},"",null,null,null,null,null,{"$f":"IF(ISBLANK(Worksheet!H76)=FALSE,Worksheet!H76,\"\")","v":""},{"$f":"IF(Worksheet!$A$11=TRUE,\"Y\",\"N\")","v":"N"},{"$f":"IF(Worksheet!$A$12=TRUE,\"Y\",\"N\")","v":"N"},{"$f":"IF(Worksheet!$B$11=TRUE,\"Y\",\"N\")","v":"N"},{"$f":"IF(Worksheet!$B$12=TRUE,\"Y\",\"N\")","v":"N"},{"$f":"IF(Worksheet!$C$11=TRUE,\"Y\",\"N\")","v":"N"},{"$f":"IF(Worksheet!$C$12=TRUE,\"Y\",\"N\")","v":"N"},{"$f":"IFERROR(Worksheet!J76,\"\")","v":0}]
[{"$f":"IF(ISBLANK(Worksheet!G77)=FALSE,331,\"\")","v":""},{"$f":"Worksheet!C77","v":0},{"$f":"Worksheet!D77","v":0},{"$f":"Worksheet!F77","v":0},"HP",null,null,{"$f":"Worksheet!I77","v":0},{"$f":"IF(ISBLANK(Worksheet!G77)=FALSE,Worksheet!G77,\"\")","v":""},{"$f":"IFERROR(IFERROR(Worksheet!O77/Worksheet!G77,Worksheet!P77/Worksheet!H77),\"\")","v":""},{"$f":"Worksheet!S77","v":0},"",null,null,null,null,null,{"$f":"IF(ISBLANK(Worksheet!H77)=FALSE,Worksheet!H77,\"\")","v":""},{"$f":"IF(Worksheet!$A$11=TRUE,\"Y\",\"N\")","v":"N"},{"$f":"IF(Worksheet!$A$12=TRUE,\"Y\",\"N\")","v":"N"},{"$f":"IF(Worksheet!$B$11=TRUE,\"Y\",\"N\")","v":"N"},{"$f":"IF(Worksheet!$B$12=TRUE,\"Y\",\"N\")","v":"N"},{"$f":"IF(Worksheet!$C$11=TRUE,\"Y\",\"N\")","v":"N"},{"$f":"IF(Worksheet!$C$12=TRUE,\"Y\",\"N\")","v":"N"},{"$f":"IFERROR(Worksheet!J77,\"\")","v":0}]
[{"$f":"IF(ISBLANK(Worksheet!G78)=FALSE,331,\"\")","v":""},{"$f":"Worksheet!C78","v":0},{"$f":"Worksheet!D78","v":0},{"$f":"Worksheet!F78","v":0},"HP",null,null,{"$f":"Worksheet!I78","v":0},{"$f":"IF(ISBLANK(Worksheet!G78)=FALSE,Worksheet!G78,\"\")","v":""},{"$f":"IFERROR(IFERROR(Worksheet!O78/Worksheet!G78,Worksheet!P78/Worksheet!H78),\"\")","v":""},{"$f":"Worksheet!S78","v":0},"",null,null,null,null,null,{"$f":"IF(ISBLANK(Worksheet!H78)=FALSE,Worksheet!H78,\"\")","v":""},{"$f":"IF(Worksheet!$A$11=TRUE,\"Y\",\"N\")","v":"N"},{"$f":"IF(Worksheet!$A$12=TRUE,\"Y\",\"N\")","v":"N"},{"$f":"IF(Worksheet!$B$11=TRUE,\"Y\",\"N\")","v":"N"},{"$f":"IF(Worksheet!$B$12=TRUE,\"Y\",\"N\")","v":"N"},{"$f":"IF(Worksheet!$C$11=TRUE,\"Y\",\"N\")","v":"N"},{"$f":"IF(Worksheet!$C$12=TRUE,\"Y\",\"N\")","v":"N"},{"$f":"IFERROR(Worksheet!J78,\"\")","v":0}]
[{"$f":"IF(ISBLANK(Worksheet!G79)=FALSE,331,\"\")","v":""},{"$f":"Worksheet!C79","v":0},{"$f":"Worksheet!D79","v":0},{"$f":"Worksheet!F79","v":0},"HP",null,null,{"$f":"Worksheet!I79","v":0},{"$f":"IF(ISBLANK(Worksheet!G79)=FALSE,Worksheet!G79,\"\")","v":""},{"$f":"IFERROR(IFERROR(Worksheet!O79/Worksheet!G79,Worksheet!P79/Worksheet!H79),\"\")","v":""},{"$f":"Worksheet!S79","v":0},"",null,null,null,null,null,{"$f":"IF(ISBLANK(Worksheet!H79)=FALSE,Worksheet!H79,\"\")","v":""},{"$f":"IF(Worksheet!$A$11=TRUE,\"Y\",\"N\")","v":"N"},{"$f":"IF(Worksheet!$A$12=TRUE,\"Y\",\"N\")","v":"N"},{"$f":"IF(Worksheet!$B$11=TRUE,\"Y\",\"N\")","v":"N"},{"$f":"IF(Worksheet!$B$12=TRUE,\"Y\",\"N\")","v":"N"},{"$f":"IF(Worksheet!$C$11=TRUE,\"Y\",\"N\")","v":"N"},{"$f":"IF(Worksheet!$C$12=TRUE,\"Y\",\"N\")","v":"N"},{"$f":"IFERROR(Worksheet!J79,\"\")","v":0}]
[{"$f":"IF(ISBLANK(Worksheet!G80)=FALSE,331,\"\")","v":""},{"$f":"Worksheet!C80","v":0},{"$f":"Worksheet!D80","v":0},{"$f":"Worksheet!F80","v":0},"HP",null,null,{"$f":"Worksheet!I80","v":0},{"$f":"IF(ISBLANK(Worksheet!G80)=FALSE,Worksheet!G80,\"\")","v":""},{"$f":"IFERROR(IFERROR(Worksheet!O80/Worksheet!G80,Worksheet!P80/Worksheet!H80),\"\")","v":""},{"$f":"Worksheet!S80","v":0},"",null,null,null,null,null,{"$f":"IF(ISBLANK(Worksheet!H80)=FALSE,Worksheet!H80,\"\")","v":""},{"$f":"IF(Worksheet!$A$11=TRUE,\"Y\",\"N\")","v":"N"},{"$f":"IF(Worksheet!$A$12=TRUE,\"Y\",\"N\")","v":"N"},{"$f":"IF(Worksheet!$B$11=TRUE,\"Y\",\"N\")","v":"N"},{"$f":"IF(Worksheet!$B$12=TRUE,\"Y\",\"N\")","v":"N"},{"$f":"IF(Worksheet!$C$11=TRUE,\"Y\",\"N\")","v":"N"},{"$f":"IF(Worksheet!$C$12=TRUE,\"Y\",\"N\")","v":"N"},{"$f":"IFERROR(Worksheet!J80,\"\")","v":0}]
[{"$f":"IF(ISBLANK(Worksheet!G81)=FALSE,331,\"\")","v":""},{"$f":"Worksheet!C81","v":0},{"$f":"Worksheet!D81","v":0},{"$f":"Worksheet!F81","v":0},"HP",null,null,{"$f":"Worksheet!I81","v":0},{"$f":"IF(ISBLANK(Worksheet!G81)=FALSE,Worksheet!G81,\"\")","v":""},{"$f":"IFERROR(IFERROR(Worksheet!O81/Worksheet!G81,Worksheet!P81/Worksheet!H81),\"\")","v":""},{"$f":"Worksheet!S81","v":0},"",null,null,null,null,null,{"$f":"IF(ISBLANK(Worksheet!H81)=FALSE,Worksheet!H81,\"\")","v":""},{"$f":"IF(Worksheet!$A$11=TRUE,\"Y\",\"N\")","v":"N"},{"$f":"IF(Worksheet!$A$12=TRUE,\"Y\",\"N\")","v":"N"},{"$f":"IF(Worksheet!$B$11=TRUE,\"Y\",\"N\")","v":"N"},{"$f":"IF(Worksheet!$B$12=TRUE,\"Y\",\"N\")","v":"N"},{"$f":"IF(Worksheet!$C$11=TRUE,\"Y\",\"N\")","v":"N"},{"$f":"IF(Worksheet!$C$12=TRUE,\"Y\",\"N\")","v":"N"},{"$f":"IFERROR(Worksheet!J81,\"\")","v":0}]
[{"$f":"IF(ISBLANK(Worksheet!G82)=FALSE,331,\"\")","v":""},{"$f":"Worksheet!C82","v":0},{"$f":"Worksheet!D82","v":0},{"$f":"Worksheet!F82","v":0},"HP",null,null,{"$f":"Worksheet!I82","v":0},{"$f":"IF(ISBLANK(Worksheet!G82)=FALSE,Worksheet!G82,\"\")","v":""},{"$f":"IFERROR(IFERROR(Worksheet!O82/Worksheet!G82,Worksheet!P82/Worksheet!H82),\"\")","v":""},{"$f":"Worksheet!S82","v":0},"",null,null,null,null,null,{"$f":"IF(ISBLANK(Worksheet!H82)=FALSE,Worksheet!H82,\"\")","v":""},{"$f":"IF(Worksheet!$A$11=TRUE,\"Y\",\"N\")","v":"N"},{"$f":"IF(Worksheet!$A$12=TRUE,\"Y\",\"N\")","v":"N"},{"$f":"IF(Worksheet!$B$11=TRUE,\"Y\",\"N\")","v":"N"},{"$f":"IF(Worksheet!$B$12=TRUE,\"Y\",\"N\")","v":"N"},{"$f":"IF(Worksheet!$C$11=TRUE,\"Y\",\"N\")","v":"N"},{"$f":"IF(Worksheet!$C$12=TRUE,\"Y\",\"N\")","v":"N"},{"$f":"IFERROR(Worksheet!J82,\"\")","v":0}]
[{"$f":"IF(ISBLANK(Worksheet!G83)=FALSE,331,\"\")","v":""},{"$f":"Worksheet!C83","v":0},{"$f":"Worksheet!D83","v":0},{"$f":"Worksheet!F83","v":0},"HP",null,null,{"$f":"Worksheet!I83","v":0},{"$f":"IF(ISBLANK(Worksheet!G83)=FALSE,Worksheet!G83,\"\")","v":""},{"$f":"IFERROR(IFERROR(Worksheet!O83/Worksheet!G83,Worksheet!P83/Worksheet!H83),\"\")","v":""},{"$f":"Worksheet!S83","v":0},"",null,null,null,null,null,{"$f":"IF(ISBLANK(Worksheet!H83)=FALSE,Worksheet!H83,\"\")","v":""},{"$f":"IF(Worksheet!$A$11=TRUE,\"Y\",\"N\")","v":"N"},{"$f":"IF(Worksheet!$A$12=TRUE,\"Y\",\"N\")","v":"N"},{"$f":"IF(Worksheet!$B$11=TRUE,\"Y\",\"N\")","v":"N"},{"$f":"IF(Worksheet!$B$12=TRUE,\"Y\",\"N\")","v":"N"},{"$f":"IF(Worksheet!$C$11=TRUE,\"Y\",\"N\")","v":"N"},{"$f":"IF(Worksheet!$C$12=TRUE,\"Y\",\"N\")","v":"N"},{"$f":"IFERROR(Worksheet!J83,\"\")","v":0}]
[{"$f":"IF(ISBLANK(Worksheet!G84)=FALSE,331,\"\")","v":""},{"$f":"Worksheet!C84","v":0},{"$f":"Worksheet!D84","v":0},{"$f":"Worksheet!F84","v":0},"HP",null,null,{"$f":"Worksheet!I84","v":0},{"$f":"IF(ISBLANK(Worksheet!G84)=FALSE,Worksheet!G84,\"\")","v":""},{"$f":"IFERROR(IFERROR(Worksheet!O84/Worksheet!G84,Worksheet!P84/Worksheet!H84),\"\")","v":""},{"$f":"Worksheet!S84","v":0},{"$f":"IFERROR(J67*15,\"\")","v":""},null,null,null,null,null,{"$f":"IF(ISBLANK(Worksheet!H84)=FALSE,Worksheet!H84,\"\")","v":""},{"$f":"IF(Worksheet!$A$11=TRUE,\"Y\",\"N\")","v":"N"},{"$f":"IF(Worksheet!$A$12=TRUE,\"Y\",\"N\")","v":"N"},{"$f":"IF(Worksheet!$B$11=TRUE,\"Y\",\"N\")","v":"N"},{"$f":"IF(Worksheet!$B$12=TRUE,\"Y\",\"N\")","v":"N"},{"$f":"IF(Worksheet!$C$11=TRUE,\"Y\",\"N\")","v":"N"},{"$f":"IF(Worksheet!$C$12=TRUE,\"Y\",\"N\")","v":"N"},{"$f":"IFERROR(Worksheet!J84,\"\")","v":0}]
[{"$f":"IF(ISBLANK(Worksheet!G85)=FALSE,331,\"\")","v":""},{"$f":"Worksheet!C85","v":0},{"$f":"Worksheet!D85","v":0},{"$f":"Worksheet!F85","v":0},"HP",null,null,{"$f":"Worksheet!I85","v":0},{"$f":"IF(ISBLANK(Worksheet!G85)=FALSE,Worksheet!G85,\"\")","v":""},{"$f":"IFERROR(IFERROR(Worksheet!O85/Worksheet!G85,Worksheet!P85/Worksheet!H85),\"\")","v":""},{"$f":"Worksheet!S85","v":0},"",null,null,null,null,null,{"$f":"IF(ISBLANK(Worksheet!H85)=FALSE,Worksheet!H85,\"\")","v":""},{"$f":"IF(Worksheet!$A$11=TRUE,\"Y\",\"N\")","v":"N"},{"$f":"IF(Worksheet!$A$12=TRUE,\"Y\",\"N\")","v":"N"},{"$f":"IF(Worksheet!$B$11=TRUE,\"Y\",\"N\")","v":"N"},{"$f":"IF(Worksheet!$B$12=TRUE,\"Y\",\"N\")","v":"N"},{"$f":"IF(Worksheet!$C$11=TRUE,\"Y\",\"N\")","v":"N"},{"$f":"IF(Worksheet!$C$12=TRUE,\"Y\",\"N\")","v":"N"},{"$f":"IFERROR(Worksheet!J85,\"\")","v":0}]
[{"$f":"IF(ISBLANK(Worksheet!G86)=FALSE,331,\"\")","v":""},{"$f":"Worksheet!C86","v":0},{"$f":"Worksheet!D86","v":0},{"$f":"Worksheet!F86","v":0},"HP",null,null,{"$f":"Worksheet!I86","v":0},{"$f":"IF(ISBLANK(Worksheet!G86)=FALSE,Worksheet!G86,\"\")","v":""},{"$f":"IFERROR(IFERROR(Worksheet!O86/Worksheet!G86,Worksheet!P86/Worksheet!H86),\"\")","v":""},{"$f":"Worksheet!S86","v":0},"",null,null,null,null,null,{"$f":"IF(ISBLANK(Worksheet!H86)=FALSE,Worksheet!H86,\"\")","v":""},{"$f":"IF(Worksheet!$A$11=TRUE,\"Y\",\"N\")","v":"N"},{"$f":"IF(Worksheet!$A$12=TRUE,\"Y\",\"N\")","v":"N"},{"$f":"IF(Worksheet!$B$11=TRUE,\"Y\",\"N\")","v":"N"},{"$f":"IF(Worksheet!$B$12=TRUE,\"Y\",\"N\")","v":"N"},{"$f":"IF(Worksheet!$C$11=TRUE,\"Y\",\"N\")","v":"N"},{"$f":"IF(Worksheet!$C$12=TRUE,\"Y\",\"N\")","v":"N"},{"$f":"IFERROR(Worksheet!J86,\"\")","v":0}]
[{"$f":"IF(ISBLANK(Worksheet!G87)=FALSE,331,\"\")","v":""},{"$f":"Worksheet!C87","v":0},{"$f":"Worksheet!D87","v":0},{"$f":"Worksheet!F87","v":0},"HP",null,null,{"$f":"Worksheet!I87","v":0},{"$f":"IF(ISBLANK(Worksheet!G87)=FALSE,Worksheet!G87,\"\")","v":""},{"$f":"IFERROR(IFERROR(Worksheet!O87/Worksheet!G87,Worksheet!P87/Worksheet!H87),\"\")","v":""},{"$f":"Worksheet!S87","v":0},"",null,null,null,null,null,{"$f":"IF(ISBLANK(Worksheet!H87)=FALSE,Worksheet!H87,\"\")","v":""},{"$f":"IF(Worksheet!$A$11=TRUE,\"Y\",\"N\")","v":"N"},{"$f":"IF(Worksheet!$A$12=TRUE,\"Y\",\"N\")","v":"N"},{"$f":"IF(Worksheet!$B$11=TRUE,\"Y\",\"N\")","v":"N"},{"$f":"IF(Worksheet!$B$12=TRUE,\"Y\",\"N\")","v":"N"},{"$f":"IF(Worksheet!$C$11=TRUE,\"Y\",\"N\")","v":"N"},{"$f":"IF(Worksheet!$C$12=TRUE,\"Y\",\"N\")","v":"N"},{"$f":"IFERROR(Worksheet!J87,\"\")","v":0}]
[{"$f":"IF(ISBLANK(Worksheet!G88)=FALSE,331,\"\")","v":""},{"$f":"Worksheet!C88","v":0},{"$f":"Worksheet!D88","v":0},{"$f":"Worksheet!F88","v":0},"HP",null,null,{"$f":"Worksheet!I88","v":0},{"$f":"IF(ISBLANK(Worksheet!G88)=FALSE,Worksheet!G88,\"\")","v":""},{"$f":"IFERROR(IFERROR(Worksheet!O88/Worksheet!G88,Worksheet!P88/Worksheet!H88),\"\")","v":""},{"$f":"Worksheet!S88","v":0},"",null,null,null,null,null,{"$f":"IF(ISBLANK(Worksheet!H88)=FALSE,Worksheet!H88,\"\")","v":""},{"$f":"IF(Worksheet!$A$11=TRUE,\"Y\",\"N\")","v":"N"},{"$f":"IF(Worksheet!$A$12=TRUE,\"Y\",\"N\")","v":"N"},{"$f":"IF(Worksheet!$B$11=TRUE,\"Y\",\"N\")","v":"N"},{"$f":"IF(Worksheet!$B$12=TRUE,\"Y\",\"N\")","v":"N"},{"$f":"IF(Worksheet!$C$11=TRUE,\"Y\",\"N\")","v":"N"},{"$f":"IF(Worksheet!$C$12=TRUE,\"Y\",\"N\")","v":"N"},{"$f":"IFERROR(Worksheet!J88,\"\")","v":0}]
[{"$f":"IF(ISBLANK(Worksheet!G89)=FALSE,331,\"\")","v":""},{"$f":"Worksheet!C89","v":0},{"$f":"Worksheet!D89","v":0},{"$f":"Worksheet!F89","v":0},"HP",null,null,{"$f":"Worksheet!I89","v":0},{"$f":"IF(ISBLANK(Worksheet!G89)=FALSE,Worksheet!G89,\"\")","v":""},{"$f":"IFERROR(IFERROR(Worksheet!O89/Worksheet!G89,Worksheet!P89/Worksheet!H89),\"\")","v":""},{"$f":"Worksheet!S89","v":0},"",null,null,null,null,null,{"$f":"IF(ISBLANK(Worksheet!H89)=FALSE,Worksheet!H89,\"\")","v":""},{"$f":"IF(Worksheet!$A$11=TRUE,\"Y\",\"N\")","v":"N"},{"$f":"IF(Worksheet!$A$12=TRUE,\"Y\",\"N\")","v":"N"},{"$f":"IF(Worksheet!$B$11=TRUE,\"Y\",\"N\")","v":"N"},{"$f":"IF(Worksheet!$B$12=TRUE,\"Y\",\"N\")","v":"N"},{"$f":"IF(Worksheet!$C$11=TRUE,\"Y\",\"N\")","v":"N"},{"$f":"IF(Worksheet!$C$12=TRUE,\"Y\",\"N\")","v":"N"},{"$f":"IFERROR(Worksheet!J89,\"\")","v":0}]
[{"$f":"IF(ISBLANK(Worksheet!G90)=FALSE,331,\"\")","v":""},{"$f":"Worksheet!C90","v":0},{"$f":"Worksheet!D90","v":0},{"$f":"Worksheet!F90","v":0},"HP",null,null,{"$f":"Worksheet!I90","v":0},{"$f":"IF(ISBLANK(Worksheet!G90)=FALSE,Worksheet!G90,\"\")","v":""},{"$f":"IFERROR(IFERROR(Worksheet!O90/Worksheet!G90,Worksheet!P90/Worksheet!H90),\"\")","v":""},{"$f":"Worksheet!S90","v":0},"",null,null,null,null,null,{"$f":"IF(ISBLANK(Worksheet!H90)=FALSE,Worksheet!H90,\"\")","v":""},{"$f":"IF(Worksheet!$A$11=TRUE,\"Y\",\"N\")","v":"N"},{"$f":"IF(Worksheet!$A$12=TRUE,\"Y\",\"N\")","v":"N"},{"$f":"IF(Worksheet!$B$11=TRUE,\"Y\",\"N\")","v":"N"},{"$f":"IF(Worksheet!$B$12=TRUE,\"Y\",\"N\")","v":"N"},{"$f":"IF(Worksheet!$C$11=TRUE,\"Y\",\"N\")","v":"N"},{"$f":"IF(Worksheet!$C$12=TRUE,\"Y\",\"N\")","v":"N"},{"$f":"IFERROR(Worksheet!J90,\"\")","v":0}]
[{"$f":"IF(ISBLANK(Worksheet!G91)=FALSE,331,\"\")","v":""},{"$f":"Worksheet!C91","v":0},{"$f":"Worksheet!D91","v":0},{"$f":"Worksheet!F91","v":0},"HP",null,null,{"$f":"Worksheet!I91","v":0},{"$f":"IF(ISBLANK(Worksheet!G91)=FALSE,Worksheet!G91,\"\")","v":""},{"$f":"IFERROR(IFERROR(Worksheet!O91/Worksheet!G91,Worksheet!P91/Worksheet!H91),\"\")","v":""},{"$f":"Worksheet!S91","v":0},"",null,null,null,null,null,{"$f":"IF(ISBLANK(Worksheet!H91)=FALSE,Worksheet!H91,\"\")","v":""},{"$f":"IF(Worksheet!$A$11=TRUE,\"Y\",\"N\")","v":"N"},{"$f":"IF(Worksheet!$A$12=TRUE,\"Y\",\"N\")","v":"N"},{"$f":"IF(Worksheet!$B$11=TRUE,\"Y\",\"N\")","v":"N"},{"$f":"IF(Worksheet!$B$12=TRUE,\"Y\",\"N\")","v":"N"},{"$f":"IF(Worksheet!$C$11=TRUE,\"Y\",\"N\")","v":"N"},{"$f":"IF(Worksheet!$C$12=TRUE,\"Y\",\"N\")","v":"N"},{"$f":"IFERROR(Worksheet!J91,\"\")","v":0}]
[{"$f":"IF(ISBLANK(Worksheet!G92)=FALSE,331,\"\")","v":""},{"$f":"Worksheet!C92","v":0},{"$f":"Worksheet!D92","v":0},{"$f":"Worksheet!F92","v":0},"HP",null,null,{"$f":"Worksheet!I92","v":0},{"$f":"IF(ISBLANK(Worksheet!G92)=FALSE,Worksheet!G92,\"\")","v":""},{"$f":"IFERROR(IFERROR(Worksheet!O92/Worksheet!G92,Worksheet!P92/Worksheet!H92),\"\")","v":""},{"$f":"Worksheet!S92","v":0},"",null,null,null,null,null,{"$f":"IF(ISBLANK(Worksheet!H92)=FALSE,Worksheet!H92,\"\")","v":""},{"$f":"IF(Worksheet!$A$11=TRUE,\"Y\",\"N\")","v":"N"},{"$f":"IF(Worksheet!$A$12=TRUE,\"Y\",\"N\")","v":"N"},{"$f":"IF(Worksheet!$B$11=TRUE,\"Y\",\"N\")","v":"N"},{"$f":"IF(Worksheet!$B$12=TRUE,\"Y\",\"N\")","v":"N"},{"$f":"IF(Worksheet!$C$11=TRUE,\"Y\",\"N\")","v":"N"},{"$f":"IF(Worksheet!$C$12=TRUE,\"Y\",\"N\")","v":"N"},{"$f":"IFERROR(Worksheet!J92,\"\")","v":0}]
[{"$f":"IF(ISBLANK(Worksheet!G93)=FALSE,331,\"\")","v":""},{"$f":"Worksheet!C93","v":0},{"$f":"Worksheet!D93","v":0},{"$f":"Worksheet!F93","v":0},"HP",null,null,{"$f":"Worksheet!I93","v":0},{"$f":"IF(ISBLANK(Worksheet!G93)=FALSE,Worksheet!G93,\"\")","v":""},{"$f":"IFERROR(IFERROR(Worksheet!O93/Worksheet!G93,Worksheet!P93/Worksheet!H93),\"\")","v":""},{"$f":"Worksheet!S93","v":0},"",null,null,null,null,null,{"$f":"IF(ISBLANK(Worksheet!H93)=FALSE,Worksheet!H93,\"\")","v":""},{"$f":"IF(Worksheet!$A$11=TRUE,\"Y\",\"N\")","v":"N"},{"$f":"IF(Worksheet!$A$12=TRUE,\"Y\",\"N\")","v":"N"},{"$f":"IF(Worksheet!$B$11=TRUE,\"Y\",\"N\")","v":"N"},{"$f":"IF(Worksheet!$B$12=TRUE,\"Y\",\"N\")","v":"N"},{"$f":"IF(Worksheet!$C$11=TRUE,\"Y\",\"N\")","v":"N"},{"$f":"IF(Worksheet!$C$12=TRUE,\"Y\",\"N\")","v":"N"},{"$f":"IFERROR(Worksheet!J93,\"\")","v":0}]

{"sheet":"Version","index":3,"n_rows":6,"n_cols":2,"rows_kept":6,"cut":false,"hidden":true,"merged":[]}
[14,"<-Version"]
["Log"]
["2013-07-10","FECM's for refrigerated cases separated from Premium Motors worksheet"]
["2018-06-26","Updated to align with FY19 Protocols"]
["2019-07-01","Added Enhanced Incentive Eligibility Section and Updated for FY20 Program"]
["2020-10-01","Updated for FY21 Program"]