{"text_format":"1","workbook":"xlsx","n_sheets":4,"sheets":["Worksheet","Measure Code","Export","Version"],"not_rendered":{"charts":0,"images":0,"macros":1,"external_links":1,"defined_names":13,"comments":0,"pivot_tables":0},"unopened":[],"bounds":{"document_bytes":16777216,"sheet_cells":100000,"rows_first":2000,"rows_last":500,"rows_between":2000,"halvings":0,"cell_chars":16384,"cell_head_chars":4096},"cells_cut":0,"cells_raw":0,"read":"whole","date_system":"1900"}

{"sheet":"Worksheet","index":0,"n_rows":93,"n_cols":23,"rows_kept":93,"cut":false,"hidden":false,"merged":[[0,0,0,3],[8,1,8,3],[7,1,7,3],[8,5,8,8],[7,5,7,8],[4,5,4,8],[3,5,3,8],[1,8,1,10],[0,8,0,10],[14,6,17,6],[14,7,17,7],[9,5,9,6],[14,5,17,5],[3,1,3,3],[5,1,5,3],[9,21,9,22],[9,19,9,20],[3,19,3,22],[4,19,7,22],[4,1,4,3],[14,0,17,0],[14,2,17,2],[14,3,17,3],[14,4,17,4],[14,1,17,1],[14,15,17,15],[14,16,17,16],[14,17,17,17],[14,18,17,18],[3,15,3,18],[4,15,7,18],[14,12,17,12],[14,13,17,13],[14,14,17,14],[14,11,17,11],[13,8,13,9],[14,8,17,8],[14,9,17,9],[14,10,17,10]]}
["FY22 SmartStart Existing Buildings - Refrigeration EC Motors v1.0",null,null,null,"Incentive amounts are estimates until verified by the Program Manager.",null,null,null,"Total Units Committed:",null,null,{"$f":"SUM(G19:G93)","v":0}]
[null,null,null,null,null,null,null,null,"Total Units Installed:",null,null,{"$f":"SUM(H19:H93)","v":0}]
["Customer Information"]
["Company",null,null,null,"Address",null,null,null,null,null,null,null,null,null,null,"Pre-Inspection Notes",null,null,null,"Post-Inspection Notes"]
["Application",null,null,null,"Date"]
["Contact"]
["Contractor/Vendor Information"]
["Company",null,null,null,"Address"]
["Contact",null,null,null,"Phone"]
["Enhanced Incentive Eligibility",null,null,null,null,null,null,null,null,null,null,null,null,null,null,null,null,null,null,"Inspection Type"]
[false,false,false]
[false,false,false]
[]
[null,null,null,null,null,null,null,null,"Totals:",null,{"$f":"SUM(K19:K93)","v":0},0,0,0,0,0,0,0]
["Measure Code","Reason\nN - New\nR - Replaced","Manufacturer","Model Number","Location","Size\n(HP)","Quantity Committed","Quantity Installed","Incentive Per Unit","Enhanced Incentive Per Unit","Total Committed Incentives","Total Installed Incentives","Demand Savings\nCommitted\nkW","Demand Savings\nCommitted\nkW","Annual Energy Savings\nCommitted\nkWh","Annual Energy Savings\nInstalled\nkWh","Lifetime Energy Savings\nCommitted\nkWh","LIfetime Energy Savings\nInstalled\nkWh","Savings at Full Load\nkW"]
[null,null,null,null,null,null,null,null,null,null,null,null,null,null,null,null,null,null,null,"FOUND PRE",null,"FOUND POST"]
[null,null,null,null,null,null,null,null,null,null,null,null,null,null,null,null,null,null,null,"(Type)","Count","(Type)","Count"]
[]
[null,null,null,null,null,null,null,null,{"$f":"IF(A19=\"RFM1\",40,0)","v":0},{"$f":"IF(OR($A$11=TRUE,$A$12=TRUE,$B$11=TRUE,$B$12=TRUE,$C$11=TRUE,$C$12=TRUE)=TRUE,I19,0)","v":0},{"$f":"G19*(I19+J19)","v":0},{"$f":"H19*(I19+J19)","v":0},{"$f":"IFERROR(S19*G19, 0)","v":0},{"$f":"IFERROR(S19*H19,0)","v":0},{"$f":"IFERROR(G19*S19*(0.25*8760+0.75*8500),0)","v":0},{"$f":"IFERROR(H19*S19*(0.25*8760+0.75*8500),0)","v":0},{"$f":"O19*15","v":0},{"$f":"P19*15","v":0},{"$f":"IF(A19=\"RFM1\",F19*(0.25*0.65+0.75*(0.25*0.29+0.75*0.53))*0.746*(1+0.28*1.6),0)","v":0}]
[null,null,null,null,null,null,null,null,{"$f":"IF(A20=\"RFM1\",40,0)","v":0},{"$f":"IF(OR($A$11=TRUE,$A$12=TRUE,$B$11=TRUE,$B$12=TRUE,$C$11=TRUE,$C$12=TRUE)=TRUE,I20,0)","v":0},{"$f":"G20*(I20+J20)","v":0},{"$f":"H20*(I20+J20)","v":0},0,0,0,0,{"$f":"O20*15","v":0},{"$f":"P20*15","v":0},0]
{"$rows_left_out":74}
{"sheet":"Measure Code","index":1,"n_rows":2,"n_cols":3,"rows_kept":2,"cut":false,"hidden":true,"merged":[]}
["Measure Code","Description","Measure Type"]
["RFM1","< 1HP Electronic Commutated Motor (ECM)",331]

{"sheet":"Export","index":2,"n_rows":76,"n_cols":25,"rows_kept":76,"cut":false,"hidden":true,"merged":[]}
["Measure Type","Manufacturer","Model","Capacity/Size","Capacity/Size Units","EER Efficiency","SEER Efficiency","Incentive Per Unit","Quantity Committed","Annual Electricity Savings","Peak Demand Reduction","Lifetime Electricity Savings","Annual Gas Savings","Lifetime Gas Savings","Efficiency- other","Efficiency- other-type","Measure ID removed","Quantity Installed","Project in UEZ","Project in OZ","Municipality","K-12 School","County","Affordable Housing","Enhanced Incentive per Unit"]
[{"$f":"IF(ISBLANK(Worksheet!G19)=FALSE,331,\"\")","v":""},{"$f":"Worksheet!C19","v":0},{"$f":"Worksheet!D19","v":0},{"$f":"Worksheet!F19","v":0},"HP",null,null,{"$f":"Worksheet!I19","v":0},{"$f":"IF(ISBLANK(Worksheet!G19)=FALSE,Worksheet!G19,\"\")","v":""},{"$f":"IFERROR(IFERROR(Worksheet!O19/Worksheet!G19,Worksheet!P19/Worksheet!H19),\"\")","v":""},{"$f":"Worksheet!S19","v":0},{"$f":"IFERROR(J2*15,\"\")","v":""},null,null,null,null,null,{"$f":"IF(ISBLANK(Worksheet!H19)=FALSE,Worksheet!H19,\"\")","v":""},{"$f":"IF(Worksheet!$A$11=TRUE,\"Y\",\"N\")","v":"N"},{"$f":"IF(Worksheet!$A$12=TRUE,\"Y\",\"N\")","v":"N"},{"$f":"IF(Worksheet!$B$11=TRUE,\"Y\",\"N\")","v":"N"},{"$f":"IF(Worksheet!$B$12=TRUE,\"Y\",\"N\")","v":"N"},{"$f":"IF(Worksheet!$C$11=TRUE,\"Y\",\"N\")","v":"N"},{"$f":"IF(Worksheet!$C$12=TRUE,\"Y\",\"N\")","v":"N"},{"$f":"IFERROR(Worksheet!J19,\"\")","v":0}]
[{"$f":"IF(ISBLANK(Worksheet!G20)=FALSE,331,\"\")","v":""},{"$f":"Worksheet!C20","v":0},{"$f":"Worksheet!D20","v":0},{"$f":"Worksheet!F20","v":0},"HP",null,null,{"$f":"Worksheet!I20","v":0},{"$f":"IF(ISBLANK(Worksheet!G20)=FALSE,Worksheet!G20,\"\")","v":""},{"$f":"IFERROR(IFERROR(Worksheet!O20/Worksheet!G20,Worksheet!P20/Worksheet!H20),\"\")","v":""},{"$f":"Worksheet!S20","v":0},{"$f":"IFERROR(J3*15,\"\")","v":""},null,null,null,null,null,{"$f":"IF(ISBLANK(Worksheet!H20)=FALSE,Worksheet!H20,\"\")","v":""},{"$f":"IF(Worksheet!$A$11=TRUE,\"Y\",\"N\")","v":"N"},{"$f":"IF(Worksheet!$A$12=TRUE,\"Y\",\"N\")","v":"N"},{"$f":"IF(Worksheet!$B$11=TRUE,\"Y\",\"N\")","v":"N"},{"$f":"IF(Worksheet!$B$12=TRUE,\"Y\",\"N\")","v":"N"},{"$f":"IF(Worksheet!$C$11=TRUE,\"Y\",\"N\")","v":"N"},{"$f":"IF(Worksheet!$C$12=TRUE,\"Y\",\"N\")","v":"N"},{"$f":"IFERROR(Worksheet!J20,\"\")","v":0}]
[{"$f":"IF(ISBLANK(Worksheet!G21)=FALSE,331,\"\")","v":""},{"$f":"Worksheet!C21","v":0},{"$f":"Worksheet!D21","v":0},{"$f":"Worksheet!F21","v":0},"HP",null,null,{"$f":"Worksheet!I21","v":0},{"$f":"IF(ISBLANK(Worksheet!G21)=FALSE,Worksheet!G21,\"\")","v":""},{"$f":"IFERROR(IFERROR(Worksheet!O21/Worksheet!G21,Worksheet!P21/Worksheet!H21),\"\")","v":""},{"$f":"Worksheet!S21","v":0},"",null,null,null,null,null,{"$f":"IF(ISBLANK(Worksheet!H21)=FALSE,Worksheet!H21,\"\")","v":""},{"$f":"IF(Worksheet!$A$11=TRUE,\"Y\",\"N\")","v":"N"},{"$f":"IF(Worksheet!$A$12=TRUE,\"Y\",\"N\")","v":"N"},{"$f":"IF(Worksheet!$B$11=TRUE,\"Y\",\"N\")","v":"N"},{"$f":"IF(Worksheet!$B$12=TRUE,\"Y\",\"N\")","v":"N"},{"$f":"IF(Worksheet!$C$11=TRUE,\"Y\",\"N\")","v":"N"},{"$f":"IF(Worksheet!$C$12=TRUE,\"Y\",\"N\")","v":"N"},{"$f":"IFERROR(Worksheet!J21,\"\")","v":0}]
[{"$f":"IF(ISBLANK(Worksheet!G22)=FALSE,331,\"\")","v":""},{"$f":"Worksheet!C22","v":0},{"$f":"Worksheet!D22","v":0},{"$f":"Worksheet!F22","v":0},"HP",null,null,{"$f":"Worksheet!I22","v":0},{"$f":"IF(ISBLANK(Worksheet!G22)=FALSE,Worksheet!G22,\"\")","v":""},{"$f":"IFERROR(IFERROR(Worksheet!O22/Worksheet!G22,Worksheet!P22/Worksheet!H22),\"\")","v":""},{"$f":"Worksheet!S22","v":0},"",null,null,null,null,null,{"$f":"IF(ISBLANK(Worksheet!H22)=FALSE,Worksheet!H22,\"\")","v":""},{"$f":"IF(Worksheet!$A$11=TRUE,\"Y\",\"N\")","v":"N"},{"$f":"IF(Worksheet!$A$12=TRUE,\"Y\",\"N\")","v":"N"},{"$f":"IF(Worksheet!$B$11=TRUE,\"Y\",\"N\")","v":"N"},{"$f":"IF(Worksheet!$B$12=TRUE,\"Y\",\"N\")","v":"N"},{"$f":"IF(Worksheet!$C$11=TRUE,\"Y\",\"N\")","v":"N"},{"$f":"IF(Worksheet!$C$12=TRUE,\"Y\",\"N\")","v":"N"},{"$f":"IFERROR(Worksheet!J22,\"\")","v":0}]
[{"$f":"IF(ISBLANK(Worksheet!G23)=FALSE,331,\"\")","v":""},{"$f":"Worksheet!C23","v":0},{"$f":"Worksheet!D23","v":0},{"$f":"Worksheet!F23","v":0},"HP",null,null,{"$f":"Worksheet!I23","v":0},{"$f":"IF(ISBLANK(Worksheet!G23)=FALSE,Worksheet!G23,\"\")","v":""},{"$f":"IFERROR(IFERROR(Worksheet!O23/Worksheet!G23,Worksheet!P23/Worksheet!H23),\"\")","v":""},{"$f":"Worksheet!S23","v":0},"",null,null,null,null,null,{"$f":"IF(ISBLANK(Worksheet!H23)=FALSE,Worksheet!H23,\"\")","v":""},{"$f":"IF(Worksheet!$A$11=TRUE,\"Y\",\"N\")","v":"N"},{"$f":"IF(Worksheet!$A$12=TRUE,\"Y\",\"N\")","v":"N"},{"$f":"IF(Worksheet!$B$11=TRUE,\"Y\",\"N\")","v":"N"},{"$f":"IF(Worksheet!$B$12=TRUE,\"Y\",\"N\")","v":"N"},{"$f":"IF(Worksheet!$C$11=TRUE,\"Y\",\"N\")","v":"N"},{"$f":"IF(Worksheet!$C$12=TRUE,\"Y\",\"N\")","v":"N"},{"$f":"IFERROR(Worksheet!J23,\"\")","v":0}]
[{"$f":"IF(ISBLANK(Worksheet!G24)=FALSE,331,\"\")","v":""},{"$f":"Worksheet!C24","v":0},{"$f":"Worksheet!D24","v":0},{"$f":"Worksheet!F24","v":0},"HP",null,null,{"$f":"Worksheet!I24","v":0},{"$f":"IF(ISBLANK(Worksheet!G24)=FALSE,Worksheet!G24,\"\")","v":""},{"$f":"IFERROR(IFERROR(Worksheet!O24/Worksheet!G24,Worksheet!P24/Worksheet!H24),\"\")","v":""},{"$f":"Worksheet!S24","v":0},"",null,null,null,null,null,{"$f":"IF(ISBLANK(Worksheet!H24)=FALSE,Worksheet!H24,\"\")","v":""},{"$f":"IF(Worksheet!$A$11=TRUE,\"Y\",\"N\")","v":"N"},{"$f":"IF(Worksheet!$A$12=TRUE,\"Y\",\"N\")","v":"N"},{"$f":"IF(Worksheet!$B$11=TRUE,\"Y\",\"N\")","v":"N"},{"$f":"IF(Worksheet!$B$12=TRUE,\"Y\",\"N\")","v":"N"},{"$f":"IF(Worksheet!$C$11=TRUE,\"Y\",\"N\")","v":"N"},{"$f":"IF(Worksheet!$C$12=TRUE,\"Y\",\"N\")","v":"N"},{"$f":"IFERROR(Worksheet!J24,\"\")","v":0}]
[{"$f":"IF(ISBLANK(Worksheet!G25)=FALSE,331,\"\")","v":""},{"$f":"Worksheet!C25","v":0},{"$f":"Worksheet!D25","v":0},{"$f":"Worksheet!F25","v":0},"HP",null,null,{"$f":"Worksheet!I25","v":0},{"$f":"IF(ISBLANK(Worksheet!G25)=FALSE,Worksheet!G25,\"\")","v":""},{"$f":"IFERROR(IFERROR(Worksheet!O25/Worksheet!G25,Worksheet!P25/Worksheet!H25),\"\")","v":""},{"$f":"Worksheet!S25","v":0},"",null,null,null,null,null,{"$f":"IF(ISBLANK(Worksheet!H25)=FALSE,Worksheet!H25,\"\")","v":""},{"$f":"IF(Worksheet!$A$11=TRUE,\"Y\",\"N\")","v":"N"},{"$f":"IF(Worksheet!$A$12=TRUE,\"Y\",\"N\")","v":"N"},{"$f":"IF(Worksheet!$B$11=TRUE,\"Y\",\"N\")","v":"N"},{"$f":"IF(Worksheet!$B$12=TRUE,\"Y\",\"N\")","v":"N"},{"$f":"IF(Worksheet!$C$11=TRUE,\"Y\",\"N\")","v":"N"},{"$f":"IF(Worksheet!$C$12=TRUE,\"Y\",\"N\")","v":"N"},{"$f":"IFERROR(Worksheet!J25,\"\")","v":0}]
[{"$f":"IF(ISBLANK(Worksheet!G26)=FALSE,331,\"\")","v":""},{"$f":"Worksheet!C26","v":0},{"$f":"Worksheet!D26","v":0},{"$f":"Worksheet!F26","v":0},"HP",null,null,{"$f":"Worksheet!I26","v":0},{"$f":"IF(ISBLANK(Worksheet!G26)=FALSE,Worksheet!G26,\"\")","v":""},{"$f":"IFERROR(IFERROR(Worksheet!O26/Worksheet!G26,Worksheet!P26/Worksheet!H26),\"\")","v":""},{"$f":"Worksheet!S26","v":0},"",null,null,null,null,null,{"$f":"IF(ISBLANK(Worksheet!H26)=FALSE,Worksheet!H26,\"\")","v":""},{"$f":"IF(Worksheet!$A$11=TRUE,\"Y\",\"N\")","v":"N"},{"$f":"IF(Worksheet!$A$12=TRUE,\"Y\",\"N\")","v":"N"},{"$f":"IF(Worksheet!$B$11=TRUE,\"Y\",\"N\")","v":"N"},{"$f":"IF(Worksheet!$B$12=TRUE,\"Y\",\"N\")","v":"N"},{"$f":"IF(Worksheet!$C$11=TRUE,\"Y\",\"N\")","v":"N"},{"$f":"IF(Worksheet!$C$12=TRUE,\"Y\",\"N\")","v":"N"},{"$f":"IFERROR(Worksheet!J26,\"\")","v":0}]
[{"$f":"IF(ISBLANK(Worksheet!G27)=FALSE,331,\"\")","v":""},{"$f":"Worksheet!C27","v":0},{"$f":"Worksheet!D27","v":0},{"$f":"Worksheet!F27","v":0},"HP",null,null,{"$f":"Worksheet!I27","v":0},{"$f":"IF(ISBLANK(Worksheet!G27)=FALSE,Worksheet!G27,\"\")","v":""},{"$f":"IFERROR(IFERROR(Worksheet!O27/Worksheet!G27,Worksheet!P27/Worksheet!H27),\"\")","v":""},{"$f":"Worksheet!S27","v":0},"",null,null,null,null,null,{"$f":"IF(ISBLANK(Worksheet!H27)=FALSE,Worksheet!H27,\"\")","v":""},{"$f":"IF(Worksheet!$A$11=TRUE,\"Y\",\"N\")","v":"N"},{"$f":"IF(Worksheet!$A$12=TRUE,\"Y\",\"N\")","v":"N"},{"$f":"IF(Worksheet!$B$11=TRUE,\"Y\",\"N\")","v":"N"},{"$f":"IF(Worksheet!$B$12=TRUE,\"Y\",\"N\")","v":"N"},{"$f":"IF(Worksheet!$C$11=TRUE,\"Y\",\"N\")","v":"N"},{"$f":"IF(Worksheet!$C$12=TRUE,\"Y\",\"N\")","v":"N"},{"$f":"IFERROR(Worksheet!J27,\"\")","v":0}]
[{"$f":"IF(ISBLANK(Worksheet!G28)=FALSE,331,\"\")","v":""},{"$f":"Worksheet!C28","v":0},{"$f":"Worksheet!D28","v":0},{"$f":"Worksheet!F28","v":0},"HP",null,null,{"$f":"Worksheet!I28","v":0},{"$f":"IF(ISBLANK(Worksheet!G28)=FALSE,Worksheet!G28,\"\")","v":""},{"$f":"IFERROR(IFERROR(Worksheet!O28/Worksheet!G28,Worksheet!P28/Worksheet!H28),\"\")","v":""},{"$f":"Worksheet!S28","v":0},"",null,null,null,null,null,{"$f":"IF(ISBLANK(Worksheet!H28)=FALSE,Worksheet!H28,\"\")","v":""},{"$f":"IF(Worksheet!$A$11=TRUE,\"Y\",\"N\")","v":"N"},{"$f":"IF(Worksheet!$A$12=TRUE,\"Y\",\"N\")","v":"N"},{"$f":"IF(Worksheet!$B$11=TRUE,\"Y\",\"N\")","v":"N"},{"$f":"IF(Worksheet!$B$12=TRUE,\"Y\",\"N\")","v":"N"},{"$f":"IF(Worksheet!$C$11=TRUE,\"Y\",\"N\")","v":"N"},{"$f":"IF(Worksheet!$C$12=TRUE,\"Y\",\"N\")","v":"N"},{"$f":"IFERROR(Worksheet!J28,\"\")","v":0}]
[{"$f":"IF(ISBLANK(Worksheet!G29)=FALSE,331,\"\")","v":""},{"$f":"Worksheet!C29","v":0},{"$f":"Worksheet!D29","v":0},{"$f":"Worksheet!F29","v":0},"HP",null,null,{"$f":"Worksheet!I29","v":0},{"$f":"IF(ISBLANK(Worksheet!G29)=FALSE,Worksheet!G29,\"\")","v":""},{"$f":"IFERROR(IFERROR(Worksheet!O29/Worksheet!G29,Worksheet!P29/Worksheet!H29),\"\")","v":""},{"$f":"Worksheet!S29","v":0},"",null,null,null,null,null,{"$f":"IF(ISBLANK(Worksheet!H29)=FALSE,Worksheet!H29,\"\")","v":""},{"$f":"IF(Worksheet!$A$11=TRUE,\"Y\",\"N\")","v":"N"},{"$f":"IF(Worksheet!$A$12=TRUE,\"Y\",\"N\")","v":"N"},{"$f":"IF(Worksheet!$B$11=TRUE,\"Y\",\"N\")","v":"N"},{"$f":"IF(Worksheet!$B$12=TRUE,\"Y\",\"N\")","v":"N"},{"$f":"IF(Worksheet!$C$11=TRUE,\"Y\",\"N\")","v":"N"},{"$f":"IF(Worksheet!$C$12=TRUE,\"Y\",\"N\")","v":"N"},{"$f":"IFERROR(Worksheet!J29,\"\")","v":0}]
[{"$f":"IF(ISBLANK(Worksheet!G30)=FALSE,331,\"\")","v":""},{"$f":"Worksheet!C30","v":0},{"$f":"Worksheet!D30","v":0},{"$f":"Worksheet!F30","v":0},"HP",null,null,{"$f":"Worksheet!I30","v":0},{"$f":"IF(ISBLANK(Worksheet!G30)=FALSE,Worksheet!G30,\"\")","v":""},{"$f":"IFERROR(IFERROR(Worksheet!O30/Worksheet!G30,Worksheet!P30/Worksheet!H30),\"\")","v":""},{"$f":"Worksheet!S30","v":0},"",null,null,null,null,null,{"$f":"IF(ISBLANK(Worksheet!H30)=FALSE,Worksheet!H30,\"\")","v":""},{"$f":"IF(Worksheet!$A$11=TRUE,\"Y\",\"N\")","v":"N"},{"$f":"IF(Worksheet!$A$12=TRUE,\"Y\",\"N\")","v":"N"},{"$f":"IF(Worksheet!$B$11=TRUE,\"Y\",\"N\")","v":"N"},{"$f":"IF(Worksheet!$B$12=TRUE,\"Y\",\"N\")","v":"N"},{"$f":"IF(Worksheet!$C$11=TRUE,\"Y\",\"N\")","v":"N"},{"$f":"IF(Worksheet!$C$12=TRUE,\"Y\",\"N\")","v":"N"},{"$f":"IFERROR(Worksheet!J30,\"\")","v":0}]
[{"$f":"IF(ISBLANK(Worksheet!G31)=FALSE,331,\"\")","v":""},{"$f":"Worksheet!C31","v":0},{"$f":"Worksheet!D31","v":0},{"$f":"Worksheet!F31","v":0},"HP",null,null,{"$f":"Worksheet!I31","v":0},{"$f":"IF(ISBLANK(Worksheet!G31)=FALSE,Worksheet!G31,\"\")","v":""},{"$f":"IFERROR(IFERROR(Worksheet!O31/Worksheet!G31,Worksheet!P31/Worksheet!H31),\"\")","v":""},{"$f":"Worksheet!S31","v":0},"",null,null,null,null,null,{"$f":"IF(ISBLANK(Worksheet!H31)=FALSE,Worksheet!H31,\"\")","v":""},{"$f":"IF(Worksheet!$A$11=TRUE,\"Y\",\"N\")","v":"N"},{"$f":"IF(Worksheet!$A$12=TRUE,\"Y\",\"N\")","v":"N"},{"$f":"IF(Worksheet!$B$11=TRUE,\"Y\",\"N\")","v":"N"},{"$f":"IF(Worksheet!$B$12=TRUE,\"Y\",\"N\")","v":"N"},{"$f":"IF(Worksheet!$C$11=TRUE,\"Y\",\"N\")","v":"N"},{"$f":"IF(Worksheet!$C$12=TRUE,\"Y\",\"N\")","v":"N"},{"$f":"IFERROR(Worksheet!J31,\"\")","v":0}]
[{"$f":"IF(ISBLANK(Worksheet!G32)=FALSE,331,\"\")","v":""},{"$f":"Worksheet!C32","v":0},{"$f":"Worksheet!D32","v":0},{"$f":"Worksheet!F32","v":0},"HP",null,null,{"$f":"Worksheet!I32","v":0},{"$f":"IF(ISBLANK(Worksheet!G32)=FALSE,Worksheet!G32,\"\")","v":""},{"$f":"IFERROR(IFERROR(Worksheet!O32/Worksheet!G32,Worksheet!P32/Worksheet!H32),\"\")","v":""},{"$f":"Worksheet!S32","v":0},"",null,null,null,null,null,{"$f":"IF(ISBLANK(Worksheet!H32)=FALSE,Worksheet!H32,\"\")","v":""},{"$f":"IF(Worksheet!$A$11=TRUE,\"Y\",\"N\")","v":"N"},{"$f":"IF(Worksheet!$A$12=TRUE,\"Y\",\"N\")","v":"N"},{"$f":"IF(Worksheet!$B$11=TRUE,\"Y\",\"N\")","v":"N"},{"$f":"IF(Worksheet!$B$12=TRUE,\"Y\",\"N\")","v":"N"},{"$f":"IF(Worksheet!$C$11=TRUE,\"Y\",\"N\")","v":"N"},{"$f":"IF(Worksheet!$C$12=TRUE,\"Y\",\"N\")","v":"N"},{"$f":"IFERROR(Worksheet!J32,\"\")","v":0}]
[{"$f":"IF(ISBLANK(Worksheet!G33)=FALSE,331,\"\")","v":""},{"$f":"Worksheet!C33","v":0},{"$f":"Worksheet!D33","v":0},{"$f":"Worksheet!F33","v":0},"HP",null,null,{"$f":"Worksheet!I33","v":0},{"$f":"IF(ISBLANK(Worksheet!G33)=FALSE,Worksheet!G33,\"\")","v":""},{"$f":"IFERROR(IFERROR(Worksheet!O33/Worksheet!G33,Worksheet!P33/Worksheet!H33),\"\")","v":""},{"$f":"Worksheet!S33","v":0},"",null,null,null,null,null,{"$f":"IF(ISBLANK(Worksheet!H33)=FALSE,Worksheet!H33,\"\")","v":""},{"$f":"IF(Worksheet!$A$11=TRUE,\"Y\",\"N\")","v":"N"},{"$f":"IF(Worksheet!$A$12=TRUE,\"Y\",\"N\")","v":"N"},{"$f":"IF(Worksheet!$B$11=TRUE,\"Y\",\"N\")","v":"N"},{"$f":"IF(Worksheet!$B$12=TRUE,\"Y\",\"N\")","v":"N"},{"$f":"IF(Worksheet!$C$11=TRUE,\"Y\",\"N\")","v":"N"},{"$f":"IF(Worksheet!$C$12=TRUE,\"Y\",\"N\")","v":"N"},{"$f":"IFERROR(Worksheet!J33,\"\")","v":0}]
[{"$f":"IF(ISBLANK(Worksheet!G34)=FALSE,331,\"\")","v":""},{"$f":"Worksheet!C34","v":0},{"$f":"Worksheet!D34","v":0},{"$f":"Worksheet!F34","v":0},"HP",null,null,{"$f":"Worksheet!I34","v":0},{"$f":"IF(ISBLANK(Worksheet!G34)=FALSE,Worksheet!G34,\"\")","v":""},{"$f":"IFERROR(IFERROR(Worksheet!O34/Worksheet!G34,Worksheet!P34/Worksheet!H34),\"\")","v":""},{"$f":"Worksheet!S34","v":0},"",null,null,null,null,null,{"$f":"IF(ISBLANK(Worksheet!H34)=FALSE,Worksheet!H34,\"\")","v":""},{"$f":"IF(Worksheet!$A$11=TRUE,\"Y\",\"N\")","v":"N"},{"$f":"IF(Worksheet!$A$12=TRUE,\"Y\",\"N\")","v":"N"},{"$f":"IF(Worksheet!$B$11=TRUE,\"Y\",\"N\")","v":"N"},{"$f":"IF(Worksheet!$B$12=TRUE,\"Y\",\"N\")","v":"N"},{"$f":"IF(Worksheet!$C$11=TRUE,\"Y\",\"N\")","v":"N"},{"$f":"IF(Worksheet!$C$12=TRUE,\"Y\",\"N\")","v":"N"},{"$f":"IFERROR(Worksheet!J34,\"\")","v":0}]
[{"$f":"IF(ISBLANK(Worksheet!G35)=FALSE,331,\"\")","v":""},{"$f":"Worksheet!C35","v":0},{"$f":"Worksheet!D35","v":0},{"$f":"Worksheet!F35","v":0},"HP",null,null,{"$f":"Worksheet!I35","v":0},{"$f":"IF(ISBLANK(Worksheet!G35)=FALSE,Worksheet!G35,\"\")","v":""},{"$f":"IFERROR(IFERROR(Worksheet!O35/Worksheet!G35,Worksheet!P35/Worksheet!H35),\"\")","v":""},{"$f":"Worksheet!S35","v":0},"",null,null,null,null,null,{"$f":"IF(ISBLANK(Worksheet!H35)=FALSE,Worksheet!H35,\"\")","v":""},{"$f":"IF(Worksheet!$A$11=TRUE,\"Y\",\"N\")","v":"N"},{"$f":"IF(Worksheet!$A$12=TRUE,\"Y\",\"N\")","v":"N"},{"$f":"IF(Worksheet!$B$11=TRUE,\"Y\",\"N\")","v":"N"},{"$f":"IF(Worksheet!$B$12=TRUE,\"Y\",\"N\")","v":"N"},{"$f":"IF(Worksheet!$C$11=TRUE,\"Y\",\"N\")","v":"N"},{"$f":"IF(Worksheet!$C$12=TRUE,\"Y\",\"N\")","v":"N"},{"$f":"IFERROR(Worksheet!J35,\"\")","v":0}]
[{"$f":"IF(ISBLANK(Worksheet!G36)=FALSE,331,\"\")","v":""},{"$f":"Worksheet!C36","v":0},{"$f":"Worksheet!D36","v":0},{"$f":"Worksheet!F36","v":0},"HP",null,null,{"$f":"Worksheet!I36","v":0},{"$f":"IF(ISBLANK(Worksheet!G36)=FALSE,Worksheet!G36,\"\")","v":""},{"$f":"IFERROR(IFERROR(Worksheet!O36/Worksheet!G36,Worksheet!P36/Worksheet!H36),\"\")","v":""},{"$f":"Worksheet!S36","v":0},"",null,null,null,null,null,{"$f":"IF(ISBLANK(Worksheet!H36)=FALSE,Worksheet!H36,\"\")","v":""},{"$f":"IF(Worksheet!$A$11=TRUE,\"Y\",\"N\")","v":"N"},{"$f":"IF(Worksheet!$A$12=TRUE,\"Y\",\"N\")","v":"N"},{"$f":"IF(Worksheet!$B$11=TRUE,\"Y\",\"N\")","v":"N"},{"$f":"IF(Worksheet!$B$12=TRUE,\"Y\",\"N\")","v":"N"},{"$f":"IF(Worksheet!$C$11=TRUE,\"Y\",\"N\")","v":"N"},{"$f":"IF(Worksheet!$C$12=TRUE,\"Y\",\"N\")","v":"N"},{"$f":"IFERROR(Worksheet!J36,\"\")","v":0}]
[{"$f":"IF(ISBLANK(Worksheet!G37)=FALSE,331,\"\")","v":""},{"$f":"Worksheet!C37","v":0},{"$f":"Worksheet!D37","v":0},{"$f":"Worksheet!F37","v":0},"HP",null,null,{"$f":"Worksheet!I37","v":0},{"$f":"IF(ISBLANK(Worksheet!G37)=FALSE,Worksheet!G37,\"\")","v":""},{"$f":"IFERROR(IFERROR(Worksheet!O37/Worksheet!G37,Worksheet!P37/Worksheet!H37),\"\")","v":""},{"$f":"Worksheet!S37","v":0},"",null,null,null,null,null,{"$f":"IF(ISBLANK(Worksheet!H37)=FALSE,Worksheet!H37,\"\")","v":""},{"$f":"IF(Worksheet!$A$11=TRUE,\"Y\",\"N\")","v":"N"},{"$f":"IF(Worksheet!$A$12=TRUE,\"Y\",\"N\")","v":"N"},{"$f":"IF(Worksheet!$B$11=TRUE,\"Y\",\"N\")","v":"N"},{"$f":"IF(Worksheet!$B$12=TRUE,\"Y\",\"N\")","v":"N"},{"$f":"IF(Worksheet!$C$11=TRUE,\"Y\",\"N\")","v":"N"},{"$f":"IF(Worksheet!$C$12=TRUE,\"Y\",\"N\")","v":"N"},{"$f":"IFERROR(Worksheet!J37,\"\")","v":0}]
{"$rows_left_out":57}
{"sheet":"Version","index":3,"n_rows":6,"n_cols":2,"rows_kept":6,"cut":false,"hidden":true,"merged":[]}
[14,"<-Version"]
["Log"]
["2013-07-10","FECM's for refrigerated cases separated from Premium Motors worksheet"]
["2018-06-26","Updated to align with FY19 Protocols"]
["2019-07-01","Added Enhanced Incentive Eligibility Section and Updated for FY20 Program"]
["2020-10-01","Updated for FY21 Program"]