{"text_format":"1","workbook":"xlsx","n_sheets":5,"sheets":["Worksheet","Measure Code","Tables","Export","Version"],"not_rendered":{"charts":0,"images":0,"macros":1,"external_links":0,"defined_names":6,"comments":0,"pivot_tables":0},"unopened":[],"bounds":{"document_bytes":16777216,"sheet_cells":100000,"rows_first":2000,"rows_last":500,"rows_between":2000,"halvings":0,"cell_chars":16384,"cell_head_chars":4096},"cells_cut":0,"cells_raw":0,"read":"whole","date_system":"1900"}

{"sheet":"Worksheet","index":0,"n_rows":43,"n_cols":37,"rows_kept":43,"cut":false,"hidden":false,"merged":[[14,2,17,2],[13,6,13,8],[8,2,8,4],[7,2,7,4],[5,2,5,4],[8,6,8,8],[4,2,4,4],[14,35,16,35],[12,27,13,27],[14,29,16,29],[14,30,16,30],[14,33,16,33],[14,34,16,34],[14,32,16,32],[0,0,0,3],[3,11,3,12],[2,11,2,12],[14,17,14,21],[5,15,5,17],[5,18,5,20],[6,15,10,17],[6,18,10,20],[14,0,17,0],[13,2,13,3],[14,14,14,16],[3,2,3,4],[3,15,3,16]]}
["FY22 SmartStart New Construction - Electric Chillers v1.0",null,null,null,"Incentive amounts are estimates until verified by the Program Manager."]
[]
["Customer Information",null,null,null,null,null,null,null,null,null,null,"Total Units Committed:",null,{"$f":"SUM($M19:$M43)","v":0}]
["Name",null,null,null,null,"Address",null,null,null,null,null,"Total Units Installed:",null,{"$f":"SUM($N19:$N43)","v":0},null,"Inspection Type",null,null,null,null,null,null,null,null,null,null,null,null,null,null,"EFLH is set in the protocol",null,null,null,"Lifetime"]
["Application",null,null,null,null,"Date",null,null,null,null,null,null,null,null,null,null,null,null,null,null,null,null,null,null,null,null,null,null,null,null,{"$f":"IF($G$14=\"\",\"\",VLOOKUP($G$14,Building_Lookup,2,FALSE))","v":""},null,"hrs/year",null,20,"years"]
["Contact",null,null,null,null,null,null,null,null,null,null,null,null,null,null,"Pre-Inspection Notes",null,null,"Post-Inspection Notes"]
["Contractor/Vendor Information"]
["Name",null,null,null,null,"Address"]
["Contact",null,null,null,null,"Phone"]
["Enhanced Incentive Eligibility"]
[false,null,false,false]
[false,null,false,false]
[null,null,null,null,null,null,null,null,null,null,null,null,null,"Total Incentive",null,null,null,null,null,null,null,null,null,"Committed","Installed",null,null,"Total Savings"]
["Project Type",null,"New Construction",null,null,"Building Type",null,null,null,null,null,null,null,null,null,null,null," ",null,null,null,null,null,{"$f":"SUM(X19:X43)","v":0},{"$f":"SUM(Y19:Y43)","v":0},null,null,null,null,null,{"$f":"SUM(AD19:AD43)","v":0},{"$f":"SUM(AE19:AE43)","v":0},null,{"$f":"SUM(AG19:AG43)","v":0},{"$f":"SUM(AH19:AH43)","v":0},{"$f":"SUM(AI19:AI43)","v":0},{"$f":"SUM(AJ19:AJ43)","v":0}]
["Measure Code","Reason","Type & Capacity Range","Application","Speed","Manufacturer","Model Number","Unit Size","Location in Building","Full Load","Part Load","Eff","# of Units","# of Units","Reference",null,null,"Incentive Calculations",null,null,null,null,null,"Total","Total",null,"Baseline","Peak Duty","Demand","Committed Peak Reduction","Installed Peak Reduction","Energy","Committed Annual Savings","Installed Annual Savings","Committed Lifetime Savings","Installed Lifetime Savings"]
{"$rows_left_out":29}
{"sheet":"Measure Code","index":1,"n_rows":25,"n_cols":13,"rows_kept":25,"cut":false,"hidden":true,"merged":[]}
["Measure Code","Type & Capacity Range","Speed","Efficiency Units","Min Capacity (Tons)","Max Capacity (Tons)","Min Full Load Efficiency","Min IPLV Efficiency","Base Incentive ($/Ton)\nEB","Base Incentive ($/Ton)\nNC","Performance Incentive ($/Ton)\nEB","Performance Incentive\n($/Ton)\nNC","Baseline Efficiency\n(kW/Ton)"]
["CHILL1","Air Cooled Chiller Capacity: tons < 150","Constant","EER",0.01,149.99,10.3,13.7,20,10,3.5,3.5,1.1879999999999999]
["CHILL2","Air Cooled Chiller Capacity: tons < 150","Variable","EER",0.01,149.99,9.6999999999999993,16.12,90,45,4,4,0.75900000000000001]
["CHILL3","Air Cooled Chiller Capacity: tons ≥ 150","Constant","EER",150,999999,10.3,14,20,10,2.75,2.75,1.1879999999999999]
["CHILL4","Air Cooled Chiller Capacity: tons ≥ 150","Variable","EER",150,999999,9.6999999999999993,16.420000000000002,92,46,4,4,0.745]
["CHILL5","Water Cooled Positive Displacement Chiller Capacity: tons < 75","Constant","kW/Ton",0.01,74.989999999999995,0.73499999999999999,0.6,13,6.5,2.25,2.25,0.75]
["CHILL6","Water Cooled Positive Displacement Chiller Capacity: tons < 75","Variable","kW/Ton",0.01,74.989999999999995,0.78,0.49,40,20,2.5,2.5,0.5]
["CHILL7","Water Cooled Positive Displacement Chiller Capacity: 75 ≤ tons < 150","Constant","kW/Ton",75,149.99,0.70599999999999996,0.56000000000000005,20,10,2,2,0.72]
["CHILL8","Water Cooled Positive Displacement Chiller Capacity: 75 ≤ tons < 150","Variable","kW/Ton",75,149.99,0.75,0.48,43,21.5,2,2,0.49]
["CHILL9","Water Cooled Positive Displacement Chiller Capacity: 150 ≤ tons < 300","Constant","kW/Ton",150,299.99,0.64700000000000002,0.54,17,8.5,2,2,0.66]
["CHILL10","Water Cooled Positive Displacement Chiller Capacity: 150 ≤ tons < 300","Variable","kW/Ton",150,299.99,0.68,0.43099999999999999,43,21.5,2,2,0.44]
["CHILL11","Water Cooled Positive Displacement Chiller Capacity: 300 ≤ tons < 600","Constant","kW/Ton",300,599.99,0.59799999999999998,0.52,15,7.5,2.25,2.25,0.61]
["CHILL12","Water Cooled Positive Displacement Chiller Capacity: 300 ≤ tons < 600","Variable","kW/Ton",300,599.99,0.625,0.40200000000000002,37,18.5,2,2,0.41]
["CHILL13","Water Cooled Positive Displacement Chiller Capacity: tons ≥ 600","Constant","kW/Ton",600,999999,0.54900000000000004,0.5,30,15,2,2,0.56000000000000005]
["CHILL14","Water Cooled Positive Displacement Chiller Capacity: tons ≥ 600","Variable","kW/Ton",600,999999,0.58499999999999996,0.372,44,22,2,2,0.38]
{"$rows_left_out":11}
{"sheet":"Tables","index":2,"n_rows":29,"n_cols":2,"rows_kept":29,"cut":false,"hidden":true,"merged":[]}
["Facility Type","Cooling EFLHc"]
["Assembly",669]
["Auto repair",426]
["Dormitory",800]
["Hospital",1424]
["Light industrial",549]
["Lodging – Hotel",2918]
["Lodging – Motel",1233]
["Office – large",720]
["Office – small",955]
["Other",736]
["Religious worship",279]
["Restaurant – fast food",645]
["Restaurant – full service",574]
["Retail – big box",1279]
{"$rows_left_out":15}
{"sheet":"Export","index":3,"n_rows":26,"n_cols":25,"rows_kept":26,"cut":false,"hidden":true,"merged":[]}
["Measure Type","Manufacturer","Model","Capacity/Size","Capacity/Size Units","EER Efficiency","SEER Efficiency","Incentive Per Unit","Quantity Committed","Annual Electricity Savings","Peak Demand Reduction","Lifetime Electricity Savings","Annual Gas Savings","Lifetime Gas Savings","Efficiency- other","Efficiency- other-type","Measure ID removed","Quantity Installed","Project in UEZ","Project in OZ","Municipality","K-12 School","County","Affordable Housing","Enhanced Incentive per Unit"]
[{"$f":"IF(ISBLANK(Worksheet!M19)=TRUE,\"\",(IF(LEFT(Worksheet!C19,1)=\"A\",70,IF(Worksheet!E19=\"Variable\",68,69))))","v":""},{"$f":"Worksheet!F19","v":0},{"$f":"Worksheet!G19","v":0},{"$f":"Worksheet!H19","v":0},"Tons",null,null,{"$f":"IFERROR(Worksheet!S19+Worksheet!U19,\"\")","v":0},{"$f":"IF(ISBLANK(Worksheet!M19)=FALSE,Worksheet!M19,\"\")","v":""},{"$f":"Worksheet!AF19","v":0},{"$f":"Worksheet!AC19","v":0},{"$f":"Worksheet!AF19*Worksheet!$AI$5","v":0},null,null,null,"kW/ton",null,{"$f":"IF(ISBLANK(Worksheet!N19)=FALSE,Worksheet!N19,\"\")","v":""},{"$f":"IF(Worksheet!$A$11=TRUE,\"Y\",\"N\")","v":"N"},{"$f":"IF(Worksheet!$A$12=TRUE,\"Y\",\"N\")","v":"N"},{"$f":"IF(Worksheet!$C$11=TRUE,\"Y\",\"N\")","v":"N"},{"$f":"IF(Worksheet!$C$12=TRUE,\"Y\",\"N\")","v":"N"},{"$f":"IF(Worksheet!$D$11=TRUE,\"Y\",\"N\")","v":"N"},{"$f":"IF(Worksheet!$D$12=TRUE,\"Y\",\"N\")","v":"N"},{"$f":"IFERROR(Worksheet!V19,\"\")","v":0}]
[{"$f":"IF(ISBLANK(Worksheet!M20)=TRUE,\"\",(IF(LEFT(Worksheet!C20,1)=\"A\",70,IF(Worksheet!E20=\"Variable\",68,69))))","v":""},{"$f":"Worksheet!F20","v":0},{"$f":"Worksheet!G20","v":0},{"$f":"Worksheet!H20","v":0},"Tons",null,null,{"$f":"IFERROR(Worksheet!S20+Worksheet!U20,\"\")","v":0},{"$f":"IF(ISBLANK(Worksheet!M20)=FALSE,Worksheet!M20,\"\")","v":""},{"$f":"Worksheet!AF20","v":0},{"$f":"Worksheet!AC20","v":0},{"$f":"Worksheet!AF20*Worksheet!$AI$5","v":0},null,null,null,"kW/ton",null,{"$f":"IF(ISBLANK(Worksheet!N20)=FALSE,Worksheet!N20,\"\")","v":""},{"$f":"IF(Worksheet!$A$11=TRUE,\"Y\",\"N\")","v":"N"},{"$f":"IF(Worksheet!$A$12=TRUE,\"Y\",\"N\")","v":"N"},{"$f":"IF(Worksheet!$C$11=TRUE,\"Y\",\"N\")","v":"N"},{"$f":"IF(Worksheet!$C$12=TRUE,\"Y\",\"N\")","v":"N"},{"$f":"IF(Worksheet!$D$11=TRUE,\"Y\",\"N\")","v":"N"},{"$f":"IF(Worksheet!$D$12=TRUE,\"Y\",\"N\")","v":"N"},{"$f":"IFERROR(Worksheet!V20,\"\")","v":0}]
[{"$f":"IF(ISBLANK(Worksheet!M21)=TRUE,\"\",(IF(LEFT(Worksheet!C21,1)=\"A\",70,IF(Worksheet!E21=\"Variable\",68,69))))","v":""},{"$f":"Worksheet!F21","v":0},{"$f":"Worksheet!G21","v":0},{"$f":"Worksheet!H21","v":0},"Tons",null,null,{"$f":"IFERROR(Worksheet!S21+Worksheet!U21,\"\")","v":0},{"$f":"IF(ISBLANK(Worksheet!M21)=FALSE,Worksheet!M21,\"\")","v":""},{"$f":"Worksheet!AF21","v":0},{"$f":"Worksheet!AC21","v":0},{"$f":"Worksheet!AF21*Worksheet!$AI$5","v":0},null,null,null,"kW/ton",null,{"$f":"IF(ISBLANK(Worksheet!N21)=FALSE,Worksheet!N21,\"\")","v":""},{"$f":"IF(Worksheet!$A$11=TRUE,\"Y\",\"N\")","v":"N"},{"$f":"IF(Worksheet!$A$12=TRUE,\"Y\",\"N\")","v":"N"},{"$f":"IF(Worksheet!$C$11=TRUE,\"Y\",\"N\")","v":"N"},{"$f":"IF(Worksheet!$C$12=TRUE,\"Y\",\"N\")","v":"N"},{"$f":"IF(Worksheet!$D$11=TRUE,\"Y\",\"N\")","v":"N"},{"$f":"IF(Worksheet!$D$12=TRUE,\"Y\",\"N\")","v":"N"},{"$f":"IFERROR(Worksheet!V21,\"\")","v":0}]
[{"$f":"IF(ISBLANK(Worksheet!M22)=TRUE,\"\",(IF(LEFT(Worksheet!C22,1)=\"A\",70,IF(Worksheet!E22=\"Variable\",68,69))))","v":""},{"$f":"Worksheet!F22","v":0},{"$f":"Worksheet!G22","v":0},{"$f":"Worksheet!H22","v":0},"Tons",null,null,{"$f":"IFERROR(Worksheet!S22+Worksheet!U22,\"\")","v":0},{"$f":"IF(ISBLANK(Worksheet!M22)=FALSE,Worksheet!M22,\"\")","v":""},{"$f":"Worksheet!AF22","v":0},{"$f":"Worksheet!AC22","v":0},{"$f":"Worksheet!AF22*Worksheet!$AI$5","v":0},null,null,null,"kW/ton",null,{"$f":"IF(ISBLANK(Worksheet!N22)=FALSE,Worksheet!N22,\"\")","v":""},{"$f":"IF(Worksheet!$A$11=TRUE,\"Y\",\"N\")","v":"N"},{"$f":"IF(Worksheet!$A$12=TRUE,\"Y\",\"N\")","v":"N"},{"$f":"IF(Worksheet!$C$11=TRUE,\"Y\",\"N\")","v":"N"},{"$f":"IF(Worksheet!$C$12=TRUE,\"Y\",\"N\")","v":"N"},{"$f":"IF(Worksheet!$D$11=TRUE,\"Y\",\"N\")","v":"N"},{"$f":"IF(Worksheet!$D$12=TRUE,\"Y\",\"N\")","v":"N"},{"$f":"IFERROR(Worksheet!V22,\"\")","v":0}]
[{"$f":"IF(ISBLANK(Worksheet!M23)=TRUE,\"\",(IF(LEFT(Worksheet!C23,1)=\"A\",70,IF(Worksheet!E23=\"Variable\",68,69))))","v":""},{"$f":"Worksheet!F23","v":0},{"$f":"Worksheet!G23","v":0},{"$f":"Worksheet!H23","v":0},"Tons",null,null,{"$f":"IFERROR(Worksheet!S23+Worksheet!U23,\"\")","v":0},{"$f":"IF(ISBLANK(Worksheet!M23)=FALSE,Worksheet!M23,\"\")","v":""},{"$f":"Worksheet!AF23","v":0},{"$f":"Worksheet!AC23","v":0},{"$f":"Worksheet!AF23*Worksheet!$AI$5","v":0},null,null,null,"kW/ton",null,{"$f":"IF(ISBLANK(Worksheet!N23)=FALSE,Worksheet!N23,\"\")","v":""},{"$f":"IF(Worksheet!$A$11=TRUE,\"Y\",\"N\")","v":"N"},{"$f":"IF(Worksheet!$A$12=TRUE,\"Y\",\"N\")","v":"N"},{"$f":"IF(Worksheet!$C$11=TRUE,\"Y\",\"N\")","v":"N"},{"$f":"IF(Worksheet!$C$12=TRUE,\"Y\",\"N\")","v":"N"},{"$f":"IF(Worksheet!$D$11=TRUE,\"Y\",\"N\")","v":"N"},{"$f":"IF(Worksheet!$D$12=TRUE,\"Y\",\"N\")","v":"N"},{"$f":"IFERROR(Worksheet!V23,\"\")","v":0}]
[{"$f":"IF(ISBLANK(Worksheet!M24)=TRUE,\"\",(IF(LEFT(Worksheet!C24,1)=\"A\",70,IF(Worksheet!E24=\"Variable\",68,69))))","v":""},{"$f":"Worksheet!F24","v":0},{"$f":"Worksheet!G24","v":0},{"$f":"Worksheet!H24","v":0},"Tons",null,null,{"$f":"IFERROR(Worksheet!S24+Worksheet!U24,\"\")","v":0},{"$f":"IF(ISBLANK(Worksheet!M24)=FALSE,Worksheet!M24,\"\")","v":""},{"$f":"Worksheet!AF24","v":0},{"$f":"Worksheet!AC24","v":0},{"$f":"Worksheet!AF24*Worksheet!$AI$5","v":0},null,null,null,"kW/ton",null,{"$f":"IF(ISBLANK(Worksheet!N24)=FALSE,Worksheet!N24,\"\")","v":""},{"$f":"IF(Worksheet!$A$11=TRUE,\"Y\",\"N\")","v":"N"},{"$f":"IF(Worksheet!$A$12=TRUE,\"Y\",\"N\")","v":"N"},{"$f":"IF(Worksheet!$C$11=TRUE,\"Y\",\"N\")","v":"N"},{"$f":"IF(Worksheet!$C$12=TRUE,\"Y\",\"N\")","v":"N"},{"$f":"IF(Worksheet!$D$11=TRUE,\"Y\",\"N\")","v":"N"},{"$f":"IF(Worksheet!$D$12=TRUE,\"Y\",\"N\")","v":"N"},{"$f":"IFERROR(Worksheet!V24,\"\")","v":0}]
[{"$f":"IF(ISBLANK(Worksheet!M25)=TRUE,\"\",(IF(LEFT(Worksheet!C25,1)=\"A\",70,IF(Worksheet!E25=\"Variable\",68,69))))","v":""},{"$f":"Worksheet!F25","v":0},{"$f":"Worksheet!G25","v":0},{"$f":"Worksheet!H25","v":0},"Tons",null,null,{"$f":"IFERROR(Worksheet!S25+Worksheet!U25,\"\")","v":0},{"$f":"IF(ISBLANK(Worksheet!M25)=FALSE,Worksheet!M25,\"\")","v":""},{"$f":"Worksheet!AF25","v":0},{"$f":"Worksheet!AC25","v":0},{"$f":"Worksheet!AF25*Worksheet!$AI$5","v":0},null,null,null,"kW/ton",null,{"$f":"IF(ISBLANK(Worksheet!N25)=FALSE,Worksheet!N25,\"\")","v":""},{"$f":"IF(Worksheet!$A$11=TRUE,\"Y\",\"N\")","v":"N"},{"$f":"IF(Worksheet!$A$12=TRUE,\"Y\",\"N\")","v":"N"},{"$f":"IF(Worksheet!$C$11=TRUE,\"Y\",\"N\")","v":"N"},{"$f":"IF(Worksheet!$C$12=TRUE,\"Y\",\"N\")","v":"N"},{"$f":"IF(Worksheet!$D$11=TRUE,\"Y\",\"N\")","v":"N"},{"$f":"IF(Worksheet!$D$12=TRUE,\"Y\",\"N\")","v":"N"},{"$f":"IFERROR(Worksheet!V25,\"\")","v":0}]
[{"$f":"IF(ISBLANK(Worksheet!M26)=TRUE,\"\",(IF(LEFT(Worksheet!C26,1)=\"A\",70,IF(Worksheet!E26=\"Variable\",68,69))))","v":""},{"$f":"Worksheet!F26","v":0},{"$f":"Worksheet!G26","v":0},{"$f":"Worksheet!H26","v":0},"Tons",null,null,{"$f":"IFERROR(Worksheet!S26+Worksheet!U26,\"\")","v":0},{"$f":"IF(ISBLANK(Worksheet!M26)=FALSE,Worksheet!M26,\"\")","v":""},{"$f":"Worksheet!AF26","v":0},{"$f":"Worksheet!AC26","v":0},{"$f":"Worksheet!AF26*Worksheet!$AI$5","v":0},null,null,null,"kW/ton",null,{"$f":"IF(ISBLANK(Worksheet!N26)=FALSE,Worksheet!N26,\"\")","v":""},{"$f":"IF(Worksheet!$A$11=TRUE,\"Y\",\"N\")","v":"N"},{"$f":"IF(Worksheet!$A$12=TRUE,\"Y\",\"N\")","v":"N"},{"$f":"IF(Worksheet!$C$11=TRUE,\"Y\",\"N\")","v":"N"},{"$f":"IF(Worksheet!$C$12=TRUE,\"Y\",\"N\")","v":"N"},{"$f":"IF(Worksheet!$D$11=TRUE,\"Y\",\"N\")","v":"N"},{"$f":"IF(Worksheet!$D$12=TRUE,\"Y\",\"N\")","v":"N"},{"$f":"IFERROR(Worksheet!V26,\"\")","v":0}]
[{"$f":"IF(ISBLANK(Worksheet!M27)=TRUE,\"\",(IF(LEFT(Worksheet!C27,1)=\"A\",70,IF(Worksheet!E27=\"Variable\",68,69))))","v":""},{"$f":"Worksheet!F27","v":0},{"$f":"Worksheet!G27","v":0},{"$f":"Worksheet!H27","v":0},"Tons",null,null,{"$f":"IFERROR(Worksheet!S27+Worksheet!U27,\"\")","v":0},{"$f":"IF(ISBLANK(Worksheet!M27)=FALSE,Worksheet!M27,\"\")","v":""},{"$f":"Worksheet!AF27","v":0},{"$f":"Worksheet!AC27","v":0},{"$f":"Worksheet!AF27*Worksheet!$AI$5","v":0},null,null,null,"kW/ton",null,{"$f":"IF(ISBLANK(Worksheet!N27)=FALSE,Worksheet!N27,\"\")","v":""},{"$f":"IF(Worksheet!$A$11=TRUE,\"Y\",\"N\")","v":"N"},{"$f":"IF(Worksheet!$A$12=TRUE,\"Y\",\"N\")","v":"N"},{"$f":"IF(Worksheet!$C$11=TRUE,\"Y\",\"N\")","v":"N"},{"$f":"IF(Worksheet!$C$12=TRUE,\"Y\",\"N\")","v":"N"},{"$f":"IF(Worksheet!$D$11=TRUE,\"Y\",\"N\")","v":"N"},{"$f":"IF(Worksheet!$D$12=TRUE,\"Y\",\"N\")","v":"N"},{"$f":"IFERROR(Worksheet!V27,\"\")","v":0}]
[{"$f":"IF(ISBLANK(Worksheet!M28)=TRUE,\"\",(IF(LEFT(Worksheet!C28,1)=\"A\",70,IF(Worksheet!E28=\"Variable\",68,69))))","v":""},{"$f":"Worksheet!F28","v":0},{"$f":"Worksheet!G28","v":0},{"$f":"Worksheet!H28","v":0},"Tons",null,null,{"$f":"IFERROR(Worksheet!S28+Worksheet!U28,\"\")","v":0},{"$f":"IF(ISBLANK(Worksheet!M28)=FALSE,Worksheet!M28,\"\")","v":""},{"$f":"Worksheet!AF28","v":0},{"$f":"Worksheet!AC28","v":0},{"$f":"Worksheet!AF28*Worksheet!$AI$5","v":0},null,null,null,"kW/ton",null,{"$f":"IF(ISBLANK(Worksheet!N28)=FALSE,Worksheet!N28,\"\")","v":""},{"$f":"IF(Worksheet!$A$11=TRUE,\"Y\",\"N\")","v":"N"},{"$f":"IF(Worksheet!$A$12=TRUE,\"Y\",\"N\")","v":"N"},{"$f":"IF(Worksheet!$C$11=TRUE,\"Y\",\"N\")","v":"N"},{"$f":"IF(Worksheet!$C$12=TRUE,\"Y\",\"N\")","v":"N"},{"$f":"IF(Worksheet!$D$11=TRUE,\"Y\",\"N\")","v":"N"},{"$f":"IF(Worksheet!$D$12=TRUE,\"Y\",\"N\")","v":"N"},{"$f":"IFERROR(Worksheet!V28,\"\")","v":0}]
[{"$f":"IF(ISBLANK(Worksheet!M29)=TRUE,\"\",(IF(LEFT(Worksheet!C29,1)=\"A\",70,IF(Worksheet!E29=\"Variable\",68,69))))","v":""},{"$f":"Worksheet!F29","v":0},{"$f":"Worksheet!G29","v":0},{"$f":"Worksheet!H29","v":0},"Tons",null,null,{"$f":"IFERROR(Worksheet!S29+Worksheet!U29,\"\")","v":0},{"$f":"IF(ISBLANK(Worksheet!M29)=FALSE,Worksheet!M29,\"\")","v":""},{"$f":"Worksheet!AF29","v":0},{"$f":"Worksheet!AC29","v":0},{"$f":"Worksheet!AF29*Worksheet!$AI$5","v":0},null,null,null,"kW/ton",null,{"$f":"IF(ISBLANK(Worksheet!N29)=FALSE,Worksheet!N29,\"\")","v":""},{"$f":"IF(Worksheet!$A$11=TRUE,\"Y\",\"N\")","v":"N"},{"$f":"IF(Worksheet!$A$12=TRUE,\"Y\",\"N\")","v":"N"},{"$f":"IF(Worksheet!$C$11=TRUE,\"Y\",\"N\")","v":"N"},{"$f":"IF(Worksheet!$C$12=TRUE,\"Y\",\"N\")","v":"N"},{"$f":"IF(Worksheet!$D$11=TRUE,\"Y\",\"N\")","v":"N"},{"$f":"IF(Worksheet!$D$12=TRUE,\"Y\",\"N\")","v":"N"},{"$f":"IFERROR(Worksheet!V29,\"\")","v":0}]
[{"$f":"IF(ISBLANK(Worksheet!M30)=TRUE,\"\",(IF(LEFT(Worksheet!C30,1)=\"A\",70,IF(Worksheet!E30=\"Variable\",68,69))))","v":""},{"$f":"Worksheet!F30","v":0},{"$f":"Worksheet!G30","v":0},{"$f":"Worksheet!H30","v":0},"Tons",null,null,{"$f":"IFERROR(Worksheet!S30+Worksheet!U30,\"\")","v":0},{"$f":"IF(ISBLANK(Worksheet!M30)=FALSE,Worksheet!M30,\"\")","v":""},{"$f":"Worksheet!AF30","v":0},{"$f":"Worksheet!AC30","v":0},{"$f":"Worksheet!AF30*Worksheet!$AI$5","v":0},null,null,null,"kW/ton",null,{"$f":"IF(ISBLANK(Worksheet!N30)=FALSE,Worksheet!N30,\"\")","v":""},{"$f":"IF(Worksheet!$A$11=TRUE,\"Y\",\"N\")","v":"N"},{"$f":"IF(Worksheet!$A$12=TRUE,\"Y\",\"N\")","v":"N"},{"$f":"IF(Worksheet!$C$11=TRUE,\"Y\",\"N\")","v":"N"},{"$f":"IF(Worksheet!$C$12=TRUE,\"Y\",\"N\")","v":"N"},{"$f":"IF(Worksheet!$D$11=TRUE,\"Y\",\"N\")","v":"N"},{"$f":"IF(Worksheet!$D$12=TRUE,\"Y\",\"N\")","v":"N"},{"$f":"IFERROR(Worksheet!V30,\"\")","v":0}]
[{"$f":"IF(ISBLANK(Worksheet!M31)=TRUE,\"\",(IF(LEFT(Worksheet!C31,1)=\"A\",70,IF(Worksheet!E31=\"Variable\",68,69))))","v":""},{"$f":"Worksheet!F31","v":0},{"$f":"Worksheet!G31","v":0},{"$f":"Worksheet!H31","v":0},"Tons",null,null,{"$f":"IFERROR(Worksheet!S31+Worksheet!U31,\"\")","v":0},{"$f":"IF(ISBLANK(Worksheet!M31)=FALSE,Worksheet!M31,\"\")","v":""},{"$f":"Worksheet!AF31","v":0},{"$f":"Worksheet!AC31","v":0},{"$f":"Worksheet!AF31*Worksheet!$AI$5","v":0},null,null,null,"kW/ton",null,{"$f":"IF(ISBLANK(Worksheet!N31)=FALSE,Worksheet!N31,\"\")","v":""},{"$f":"IF(Worksheet!$A$11=TRUE,\"Y\",\"N\")","v":"N"},{"$f":"IF(Worksheet!$A$12=TRUE,\"Y\",\"N\")","v":"N"},{"$f":"IF(Worksheet!$C$11=TRUE,\"Y\",\"N\")","v":"N"},{"$f":"IF(Worksheet!$C$12=TRUE,\"Y\",\"N\")","v":"N"},{"$f":"IF(Worksheet!$D$11=TRUE,\"Y\",\"N\")","v":"N"},{"$f":"IF(Worksheet!$D$12=TRUE,\"Y\",\"N\")","v":"N"},{"$f":"IFERROR(Worksheet!V31,\"\")","v":0}]
[{"$f":"IF(ISBLANK(Worksheet!M32)=TRUE,\"\",(IF(LEFT(Worksheet!C32,1)=\"A\",70,IF(Worksheet!E32=\"Variable\",68,69))))","v":""},{"$f":"Worksheet!F32","v":0},{"$f":"Worksheet!G32","v":0},{"$f":"Worksheet!H32","v":0},"Tons",null,null,{"$f":"IFERROR(Worksheet!S32+Worksheet!U32,\"\")","v":0},{"$f":"IF(ISBLANK(Worksheet!M32)=FALSE,Worksheet!M32,\"\")","v":""},{"$f":"Worksheet!AF32","v":0},{"$f":"Worksheet!AC32","v":0},{"$f":"Worksheet!AF32*Worksheet!$AI$5","v":0},null,null,null,"kW/ton",null,{"$f":"IF(ISBLANK(Worksheet!N32)=FALSE,Worksheet!N32,\"\")","v":""},{"$f":"IF(Worksheet!$A$11=TRUE,\"Y\",\"N\")","v":"N"},{"$f":"IF(Worksheet!$A$12=TRUE,\"Y\",\"N\")","v":"N"},{"$f":"IF(Worksheet!$C$11=TRUE,\"Y\",\"N\")","v":"N"},{"$f":"IF(Worksheet!$C$12=TRUE,\"Y\",\"N\")","v":"N"},{"$f":"IF(Worksheet!$D$11=TRUE,\"Y\",\"N\")","v":"N"},{"$f":"IF(Worksheet!$D$12=TRUE,\"Y\",\"N\")","v":"N"},{"$f":"IFERROR(Worksheet!V32,\"\")","v":0}]
{"$rows_left_out":12}
{"sheet":"Version","index":4,"n_rows":13,"n_cols":2,"rows_kept":13,"cut":false,"hidden":true,"merged":[]}
[14]
["Log"]
["Updated for new Baseline Efficiencies for Protocol effective 1/1/08"]
["Updated for compatability with Measure Tracking on 12/1/2008"]
["Updated to reflect new incentive structure on 7/13/09.  Changes in red."]
["2012-01-01","no changfe for V5"]
["2012-09-20","changed IPLV/PLV columns to a efficiency type and efficiency column and lined up savings calc to protocol (now references both IPLV and FLV)"]
["2013-04-01","fixed formula in Savings per Unit column, but this shouldn't have any effect on results whatsover. Also changed the measure ID column of the export tab to reference the Efficiency Rating Type column when deciding whether to use the \"part load chiller\" or \"full load chiller\" measure ID."]
["2013-07-09","no change for V7, skipped V6"]
["2015-06-20","Worksheet and Tables Tabs updated for V9 by Aimee Lalonde, QC Mike Roberts"]
["2018-06-21","Updated to align with FY19 Protocols"]
["2019-07-01","Added Enhanced Incentive Eligibility Section and Updated for FY20 Program"]
["2020-10-01","Updated for FY21 Program"]