{"text_format":"1","workbook":"xlsx","n_sheets":7,"sheets":["Worksheet","Measure Code","electric cooking device list","Incentive Structure","Building Type","Export","Version"],"not_rendered":{"charts":0,"images":0,"macros":1,"external_links":0,"defined_names":31,"comments":0,"pivot_tables":0},"unopened":[],"bounds":{"document_bytes":16777216,"sheet_cells":100000,"rows_first":2000,"rows_last":500,"rows_between":2000,"halvings":0,"cell_chars":16384,"cell_head_chars":4096},"cells_cut":0,"cells_raw":0,"read":"whole","date_system":"1900"}

{"sheet":"Worksheet","index":0,"n_rows":38,"n_cols":46,"rows_kept":38,"cut":false,"hidden":false,"merged":[[7,2,7,3],[7,6,7,9],[2,2,2,4],[2,6,2,13],[6,2,6,3],[6,6,6,13],[4,2,4,4],[3,2,3,4],[4,35,4,37],[5,32,8,34],[5,35,8,37],[2,33,2,34],[4,32,4,34],[0,0,0,3]]}
["FY22 SmartStart New Construction - Food Service Equipment v1.0",null,null,null,"Incentive amounts are estimates until verified by the Program Manager."]
["Customer Information",null,null,null,null,null,null,null,null,null,null,null,null,null,null,null,null,null,null,null,null,null,null,"Total Units Committed:",null,null,{"$f":"SUM($Y14:$Y38)","v":0}]
["Name",null,null,null,null,"Address",null,null,null,null,null,null,null,null,null,null,null,null,null,null,null,null,null,"Total Units Installed:",null,null,{"$f":"SUM($Z14:$Z38)","v":0},null,null,null,null,null,"Inspection Type"]
["Application",null,null,null,null,"Date"]
["Contact",null,null,null,null,null,null,null,null,null,null,null,null,null,null,null,null,null,null,null,null,null,null,null,null,null,null,null,null,null,null,null,"Pre-Inspection Notes",null,null,"Post-Inspection Notes"]
["Contractor/Vendor Information"]
["Name",null,null,null,null,"Address"]
["Contact",null,null,null," ","Phone"]
["Enhanced Incentive Eligibility"]
[false,null,false,false]
{"$rows_left_out":29}
{"sheet":"Measure Code","index":1,"n_rows":58,"n_cols":5,"rows_kept":58,"cut":false,"hidden":true,"merged":[]}
["Measure Code","Incentive Category","Incentive Subcategory","Description","Measure ID in DB"]
["FOOD1","Cooking","Combination Oven Steamer Electric","Combination Oven Steamer Electric - <15 Pans",1404]
["FOOD2","Cooking","Combination Oven Steamer Electric","Combination Oven Steamer Electric - 15 to 28 pans",1404]
["FOOD3","Cooking","Combination Oven Steamer Electric","Combination Oven Steamer Electric - >28 Pans",1404]
["FOOD4","Cooking","Combination Oven Steamer Natural Gas","Combination Oven Steamer Natural Gas - <15 Pans",1405]
["FOOD5","Cooking","Combination Oven Steamer Natural Gas","Combination Oven Steamer Natural Gas - 15 to 28 pans",1405]
["FOOD6","Cooking","Combination Oven Steamer Natural Gas","Combination Oven Steamer Natural Gas - >28 Pans",1405]
["FOOD7","Cooling","Glass Door Refrigerators","Energy Star - Internal Volume <15 CF",1406]
["FOOD8","Cooling","Glass Door Refrigerators","Energy Star - Internal Volume 15-29.9 CF",1406]
["FOOD9","Cooling","Glass Door Refrigerators","Energy Star - Internal Volume 30-49.9 CF",1406]
{"$rows_left_out":49}
{"sheet":"electric cooking device list","index":2,"n_rows":10,"n_cols":8,"rows_kept":10,"cut":false,"hidden":true,"merged":[]}
[]
[null,null,null,null,null,null,"equivalent max btuh","kW"]
[null,"FOOD1","Cooking","Combination Oven Steamer Electric","Combination Oven Steamer Electric - <15 Pans",1404,{"$f":"200*15+6511","v":9511},{"$f":"((G3-6511)/200)*0.133+0.64","v":2.6350000000000002}]
[null,"FOOD2","Cooking","Combination Oven Steamer Electric","Combination Oven Steamer Electric - 15 to 28 pans",1404,{"$f":"200*28+6511","v":12111},{"$f":"((G4-6511)/200)*0.133+0.64","v":4.3639999999999999}]
[null,"FOOD3","Cooking","Combination Oven Steamer Electric","Combination Oven Steamer Electric - >28 Pans",1404,{"$f":"200*29+6511","v":12311},4.4969999999999999]
[null,"FOOD37","Cooking","Convection Oven Electric","Convection Oven Electric",1398,12000,1.6]
[null,"FOOD43","Cooking","Fryer Electric","Fryer Electric",1392,9000,0.8]
[null,"FOOD45","Cooking","Large Vat Fryer Electric","Large Vat Fryer Electric",1392,12000,1.1000000000000001]
[null,"FOOD47","Cooking","Griddle Electric","Griddle Electric",1394,2650,0.35499999999999998]
[null,"FOOD49","Cooking","Steam Cooker Electric","Steam Cooker Electric",1402,6250,0.4]
{"$rows_left_out":1}
{"sheet":"Incentive Structure","index":3,"n_rows":60,"n_cols":15,"rows_kept":60,"cut":false,"hidden":true,"merged":[[2,11,2,14],[1,1,1,9]]}
[]
[null,"Food Service Equipment Incentives"]
[null,"Category","Subcategory","Measure ID",null,"Subcategory","Description","Key","Incentive","Unit Measure",null,"TEST"]
[null,"Cooking","Combination Oven Steamer Electric",1404,null,"Combination Oven Steamer Electric","Combination Oven Steamer Electric - <15 Pans",{"$f":"C4&G4","v":"Combination Oven Steamer ElectricCombination Oven Steamer Electric - <15 Pans"},1000,"oven",null,"Cooking","Convection Oven Natural Gas","Convection Oven Natural Gas",{"$f":"VLOOKUP(N4,G4:J56,2,0)","v":"Convection Oven Natural GasConvection Oven Natural Gas"}]
[null,"Cooking","Combination Oven Steamer Natural Gas",1405,null,"Combination Oven Steamer Electric","Combination Oven Steamer Electric - 15 to 28 pans",{"$f":"C4&G5","v":"Combination Oven Steamer ElectricCombination Oven Steamer Electric - 15 to 28 pans"},1000,"oven"]
[null,"Cooking","Convection Oven Electric",1398,null,"Combination Oven Steamer Electric","Combination Oven Steamer Electric - >28 Pans",{"$f":"C4&G6","v":"Combination Oven Steamer ElectricCombination Oven Steamer Electric - >28 Pans"},1000,"oven"]
[null,"Cooking","Convection Oven Natural Gas",1399,null,"Combination Oven Steamer Natural Gas","Combination Oven Steamer Natural Gas - <15 Pans",{"$f":"C5&G7","v":"Combination Oven Steamer Natural GasCombination Oven Steamer Natural Gas - <15 Pans"},750,"oven"]
[null,"Cooking","Rack Oven Natural Gas",1400,null,"Combination Oven Steamer Natural Gas","Combination Oven Steamer Natural Gas - 15 to 28 pans",{"$f":"C5&G8","v":"Combination Oven Steamer Natural GasCombination Oven Steamer Natural Gas - 15 to 28 pans"},750,"oven",null,"Cooling","Glass Door Freezers","Energy Star - Internal Volume 15-29.9 CF",{"$f":"VLOOKUP(N8,G8:J60,2,0)","v":"Glass Door RefrigeratorsEnergy Star - Internal Volume 15-29.9 CF"}]
[null,"Cooking","Conveyor Oven Natural Gas",1401,null,"Combination Oven Steamer Natural Gas","Combination Oven Steamer Natural Gas - >28 Pans",{"$f":"C5&G9","v":"Combination Oven Steamer Natural GasCombination Oven Steamer Natural Gas - >28 Pans"},750,"oven"]
[null,"Cooking","Fryer Electric",1392,null,"Convection Oven Electric","Convection Oven Electric",{"$f":"C6&Convection_Oven_Electric","v":"Convection Oven ElectricConvection Oven Electric"},350,"oven"]
{"$rows_left_out":51}
{"sheet":"Building Type","index":4,"n_rows":24,"n_cols":9,"rows_kept":24,"cut":false,"hidden":true,"merged":[[1,0,1,2],[1,6,1,8]]}
[]
["Table 2 - Operating Days/Hours by Building Type                                        (pg 118 - 3/14/2014 Protocols)",null,null,null,null,null,"Appendix A - Measure Lives Used in Cost Effectiveness Screening      April 2012"]
["Building Type - For Insulated Holding Cabinents","Days/Year","Hours/Day",null,null,null,"Category","Subcategory","Appliance Lifetime"]
["Education - Primary School",180,8,null,null,null,"Cooking","Combination Oven Steamer Electric",12]
["Education - Secondary School",210,11,null,null,null,"Cooking","Combination Oven Steamer Natural Gas",12]
["Education - Community College",237,16,null,null,null,"Cooking","Convection Oven Electric",12]
["Education - University",192,16,null,null,null,"Cooking","Convection Oven Natural Gas",12]
["Grocery",364,16,null,null,null,"Cooking","Rack Oven Natural Gas",12]
["Medical - Hospital",364,24,null,null,null,"Cooking","Conveyor Oven Natural Gas",12]
["Medical - Clinic",351,12,null,null,null,"Cooking","Fryer Electric",12]
{"$rows_left_out":15}
{"sheet":"Export","index":5,"n_rows":27,"n_cols":25,"rows_kept":27,"cut":false,"hidden":true,"merged":[]}
["Measure Type","Manufacturer","Model","Capacity/Size","Capacity/Size Units","EER Efficiency","SEER Efficiency","Incentive Per Unit","Quantity Committed","Annual Electricity Savings","Peak Demand Reduction","Lifetime Electricity Savings","Annual Gas Savings","Lifetime Gas Savings","Efficiency- other","Efficiency- other-type","Measure ID removed","Quantity Installed","Project in UEZ","Project in OZ","Municipality","K-12 School","County","Affordable Housing","Enhanced Incentive per Unit"]
[{"$f":"IF(Worksheet!$C14<>\"\",VLOOKUP(Worksheet!D14,'Incentive Structure'!$C$4:$D$24,2,FALSE),\"\")","v":""},{"$f":"Worksheet!F14","v":0},{"$f":"Worksheet!G14","v":0},null,null,null,null,{"$f":"Worksheet!AA14","v":0},{"$f":"IF(ISBLANK(Worksheet!Y14)=FALSE,Worksheet!Y14,\"\")","v":""},{"$f":"IFERROR(IF(ISBLANK(Worksheet!$Y14)=FALSE,Worksheet!AG14/Worksheet!$Y14,Worksheet!AH14/Worksheet!$Z14),\"\")","v":""},{"$f":"IFERROR(IF(ISBLANK(Worksheet!$Y14)=FALSE,Worksheet!AE14/Worksheet!$Y14,Worksheet!AF14/Worksheet!$Z14),\"\")","v":""},{"$f":"IFERROR(IF(ISBLANK(Worksheet!$Y14)=FALSE,Worksheet!AI14/Worksheet!$Y14,Worksheet!AJ14/Worksheet!$Z14),\"\")","v":""},{"$f":"IFERROR(IF(ISBLANK(Worksheet!$Y14)=FALSE,Worksheet!AK14/Worksheet!$Y14,Worksheet!AL14/Worksheet!$Z14),\"\")","v":""},{"$f":"IFERROR(IF(ISBLANK(Worksheet!$Y14)=FALSE,Worksheet!AM14/Worksheet!$Y14,Worksheet!AN14/Worksheet!$Z14),\"\")","v":""},null,null,null,{"$f":"IF(ISBLANK(Worksheet!Z14)=FALSE,Worksheet!Z14,\"\")","v":""},{"$f":"IF(Worksheet!$A$10=TRUE,\"Y\",\"N\")","v":"N"},{"$f":"IF(Worksheet!$A$11=TRUE,\"Y\",\"N\")","v":"N"},{"$f":"IF(Worksheet!$C$10=TRUE,\"Y\",\"N\")","v":"N"},{"$f":"IF(Worksheet!$C$11=TRUE,\"Y\",\"N\")","v":"N"},{"$f":"IF(Worksheet!$D$10=TRUE,\"Y\",\"N\")","v":"N"},{"$f":"IF(Worksheet!$D$11=TRUE,\"Y\",\"N\")","v":"N"},{"$f":"IFERROR(Worksheet!AB14,\"\")","v":0}]
[{"$f":"IF(Worksheet!$C15<>\"\",VLOOKUP(Worksheet!D15,'Incentive Structure'!$C$4:$D$24,2,FALSE),\"\")","v":""},{"$f":"Worksheet!F15","v":0},{"$f":"Worksheet!G15","v":0},null,null,null,null,{"$f":"Worksheet!AA15","v":0},{"$f":"IF(ISBLANK(Worksheet!Y15)=FALSE,Worksheet!Y15,\"\")","v":""},{"$f":"IFERROR(IF(ISBLANK(Worksheet!$Y15)=FALSE,Worksheet!AG15/Worksheet!$Y15,Worksheet!AH15/Worksheet!$Z15),\"\")","v":""},{"$f":"IFERROR(IF(ISBLANK(Worksheet!$Y15)=FALSE,Worksheet!AE15/Worksheet!$Y15,Worksheet!AF15/Worksheet!$Z15),\"\")","v":""},{"$f":"IFERROR(IF(ISBLANK(Worksheet!$Y15)=FALSE,Worksheet!AI15/Worksheet!$Y15,Worksheet!AJ15/Worksheet!$Z15),\"\")","v":""},{"$f":"IFERROR(IF(ISBLANK(Worksheet!$Y15)=FALSE,Worksheet!AK15/Worksheet!$Y15,Worksheet!AL15/Worksheet!$Z15),\"\")","v":""},{"$f":"IFERROR(IF(ISBLANK(Worksheet!$Y15)=FALSE,Worksheet!AM15/Worksheet!$Y15,Worksheet!AN15/Worksheet!$Z15),\"\")","v":""},null,null,null,{"$f":"IF(ISBLANK(Worksheet!Z15)=FALSE,Worksheet!Z15,\"\")","v":""},{"$f":"IF(Worksheet!$A$10=TRUE,\"Y\",\"N\")","v":"N"},{"$f":"IF(Worksheet!$A$11=TRUE,\"Y\",\"N\")","v":"N"},{"$f":"IF(Worksheet!$C$10=TRUE,\"Y\",\"N\")","v":"N"},{"$f":"IF(Worksheet!$C$11=TRUE,\"Y\",\"N\")","v":"N"},{"$f":"IF(Worksheet!$D$10=TRUE,\"Y\",\"N\")","v":"N"},{"$f":"IF(Worksheet!$D$11=TRUE,\"Y\",\"N\")","v":"N"},{"$f":"IFERROR(Worksheet!AB15,\"\")","v":0}]
[{"$f":"IF(Worksheet!$C16<>\"\",VLOOKUP(Worksheet!D16,'Incentive Structure'!$C$4:$D$24,2,FALSE),\"\")","v":""},{"$f":"Worksheet!F16","v":0},{"$f":"Worksheet!G16","v":0},null,null,null,null,{"$f":"Worksheet!AA16","v":0},{"$f":"IF(ISBLANK(Worksheet!Y16)=FALSE,Worksheet!Y16,\"\")","v":""},{"$f":"IFERROR(IF(ISBLANK(Worksheet!$Y16)=FALSE,Worksheet!AG16/Worksheet!$Y16,Worksheet!AH16/Worksheet!$Z16),\"\")","v":""},{"$f":"IFERROR(IF(ISBLANK(Worksheet!$Y16)=FALSE,Worksheet!AE16/Worksheet!$Y16,Worksheet!AF16/Worksheet!$Z16),\"\")","v":""},{"$f":"IFERROR(IF(ISBLANK(Worksheet!$Y16)=FALSE,Worksheet!AI16/Worksheet!$Y16,Worksheet!AJ16/Worksheet!$Z16),\"\")","v":""},{"$f":"IFERROR(IF(ISBLANK(Worksheet!$Y16)=FALSE,Worksheet!AK16/Worksheet!$Y16,Worksheet!AL16/Worksheet!$Z16),\"\")","v":""},{"$f":"IFERROR(IF(ISBLANK(Worksheet!$Y16)=FALSE,Worksheet!AM16/Worksheet!$Y16,Worksheet!AN16/Worksheet!$Z16),\"\")","v":""},null,null,null,{"$f":"IF(ISBLANK(Worksheet!Z16)=FALSE,Worksheet!Z16,\"\")","v":""},{"$f":"IF(Worksheet!$A$10=TRUE,\"Y\",\"N\")","v":"N"},{"$f":"IF(Worksheet!$A$11=TRUE,\"Y\",\"N\")","v":"N"},{"$f":"IF(Worksheet!$C$10=TRUE,\"Y\",\"N\")","v":"N"},{"$f":"IF(Worksheet!$C$11=TRUE,\"Y\",\"N\")","v":"N"},{"$f":"IF(Worksheet!$D$10=TRUE,\"Y\",\"N\")","v":"N"},{"$f":"IF(Worksheet!$D$11=TRUE,\"Y\",\"N\")","v":"N"},{"$f":"IFERROR(Worksheet!AB16,\"\")","v":0}]
[{"$f":"IF(Worksheet!$C17<>\"\",VLOOKUP(Worksheet!D17,'Incentive Structure'!$C$4:$D$24,2,FALSE),\"\")","v":""},{"$f":"Worksheet!F17","v":0},{"$f":"Worksheet!G17","v":0},null,null,null,null,{"$f":"Worksheet!AA17","v":0},{"$f":"IF(ISBLANK(Worksheet!Y17)=FALSE,Worksheet!Y17,\"\")","v":""},{"$f":"IFERROR(IF(ISBLANK(Worksheet!$Y17)=FALSE,Worksheet!AG17/Worksheet!$Y17,Worksheet!AH17/Worksheet!$Z17),\"\")","v":""},{"$f":"IFERROR(IF(ISBLANK(Worksheet!$Y17)=FALSE,Worksheet!AE17/Worksheet!$Y17,Worksheet!AF17/Worksheet!$Z17),\"\")","v":""},{"$f":"IFERROR(IF(ISBLANK(Worksheet!$Y17)=FALSE,Worksheet!AI17/Worksheet!$Y17,Worksheet!AJ17/Worksheet!$Z17),\"\")","v":""},{"$f":"IFERROR(IF(ISBLANK(Worksheet!$Y17)=FALSE,Worksheet!AK17/Worksheet!$Y17,Worksheet!AL17/Worksheet!$Z17),\"\")","v":""},{"$f":"IFERROR(IF(ISBLANK(Worksheet!$Y17)=FALSE,Worksheet!AM17/Worksheet!$Y17,Worksheet!AN17/Worksheet!$Z17),\"\")","v":""},null,null,null,{"$f":"IF(ISBLANK(Worksheet!Z17)=FALSE,Worksheet!Z17,\"\")","v":""},{"$f":"IF(Worksheet!$A$10=TRUE,\"Y\",\"N\")","v":"N"},{"$f":"IF(Worksheet!$A$11=TRUE,\"Y\",\"N\")","v":"N"},{"$f":"IF(Worksheet!$C$10=TRUE,\"Y\",\"N\")","v":"N"},{"$f":"IF(Worksheet!$C$11=TRUE,\"Y\",\"N\")","v":"N"},{"$f":"IF(Worksheet!$D$10=TRUE,\"Y\",\"N\")","v":"N"},{"$f":"IF(Worksheet!$D$11=TRUE,\"Y\",\"N\")","v":"N"},{"$f":"IFERROR(Worksheet!AB17,\"\")","v":0}]
[{"$f":"IF(Worksheet!$C18<>\"\",VLOOKUP(Worksheet!D18,'Incentive Structure'!$C$4:$D$24,2,FALSE),\"\")","v":""},{"$f":"Worksheet!F18","v":0},{"$f":"Worksheet!G18","v":0},null,null,null,null,{"$f":"Worksheet!AA18","v":0},{"$f":"IF(ISBLANK(Worksheet!Y18)=FALSE,Worksheet!Y18,\"\")","v":""},{"$f":"IFERROR(IF(ISBLANK(Worksheet!$Y18)=FALSE,Worksheet!AG18/Worksheet!$Y18,Worksheet!AH18/Worksheet!$Z18),\"\")","v":""},{"$f":"IFERROR(IF(ISBLANK(Worksheet!$Y18)=FALSE,Worksheet!AE18/Worksheet!$Y18,Worksheet!AF18/Worksheet!$Z18),\"\")","v":""},{"$f":"IFERROR(IF(ISBLANK(Worksheet!$Y18)=FALSE,Worksheet!AI18/Worksheet!$Y18,Worksheet!AJ18/Worksheet!$Z18),\"\")","v":""},{"$f":"IFERROR(IF(ISBLANK(Worksheet!$Y18)=FALSE,Worksheet!AK18/Worksheet!$Y18,Worksheet!AL18/Worksheet!$Z18),\"\")","v":""},{"$f":"IFERROR(IF(ISBLANK(Worksheet!$Y18)=FALSE,Worksheet!AM18/Worksheet!$Y18,Worksheet!AN18/Worksheet!$Z18),\"\")","v":""},null,null,null,{"$f":"IF(ISBLANK(Worksheet!Z18)=FALSE,Worksheet!Z18,\"\")","v":""},{"$f":"IF(Worksheet!$A$10=TRUE,\"Y\",\"N\")","v":"N"},{"$f":"IF(Worksheet!$A$11=TRUE,\"Y\",\"N\")","v":"N"},{"$f":"IF(Worksheet!$C$10=TRUE,\"Y\",\"N\")","v":"N"},{"$f":"IF(Worksheet!$C$11=TRUE,\"Y\",\"N\")","v":"N"},{"$f":"IF(Worksheet!$D$10=TRUE,\"Y\",\"N\")","v":"N"},{"$f":"IF(Worksheet!$D$11=TRUE,\"Y\",\"N\")","v":"N"},{"$f":"IFERROR(Worksheet!AB18,\"\")","v":0}]
[{"$f":"IF(Worksheet!$C19<>\"\",VLOOKUP(Worksheet!D19,'Incentive Structure'!$C$4:$D$24,2,FALSE),\"\")","v":""},{"$f":"Worksheet!F19","v":0},{"$f":"Worksheet!G19","v":0},null,null,null,null,{"$f":"Worksheet!AA19","v":0},{"$f":"IF(ISBLANK(Worksheet!Y19)=FALSE,Worksheet!Y19,\"\")","v":""},{"$f":"IFERROR(IF(ISBLANK(Worksheet!$Y19)=FALSE,Worksheet!AG19/Worksheet!$Y19,Worksheet!AH19/Worksheet!$Z19),\"\")","v":""},{"$f":"IFERROR(IF(ISBLANK(Worksheet!$Y19)=FALSE,Worksheet!AE19/Worksheet!$Y19,Worksheet!AF19/Worksheet!$Z19),\"\")","v":""},{"$f":"IFERROR(IF(ISBLANK(Worksheet!$Y19)=FALSE,Worksheet!AI19/Worksheet!$Y19,Worksheet!AJ19/Worksheet!$Z19),\"\")","v":""},{"$f":"IFERROR(IF(ISBLANK(Worksheet!$Y19)=FALSE,Worksheet!AK19/Worksheet!$Y19,Worksheet!AL19/Worksheet!$Z19),\"\")","v":""},{"$f":"IFERROR(IF(ISBLANK(Worksheet!$Y19)=FALSE,Worksheet!AM19/Worksheet!$Y19,Worksheet!AN19/Worksheet!$Z19),\"\")","v":""},null,null,null,{"$f":"IF(ISBLANK(Worksheet!Z19)=FALSE,Worksheet!Z19,\"\")","v":""},{"$f":"IF(Worksheet!$A$10=TRUE,\"Y\",\"N\")","v":"N"},{"$f":"IF(Worksheet!$A$11=TRUE,\"Y\",\"N\")","v":"N"},{"$f":"IF(Worksheet!$C$10=TRUE,\"Y\",\"N\")","v":"N"},{"$f":"IF(Worksheet!$C$11=TRUE,\"Y\",\"N\")","v":"N"},{"$f":"IF(Worksheet!$D$10=TRUE,\"Y\",\"N\")","v":"N"},{"$f":"IF(Worksheet!$D$11=TRUE,\"Y\",\"N\")","v":"N"},{"$f":"IFERROR(Worksheet!AB19,\"\")","v":0}]
[{"$f":"IF(Worksheet!$C20<>\"\",VLOOKUP(Worksheet!D20,'Incentive Structure'!$C$4:$D$24,2,FALSE),\"\")","v":""},{"$f":"Worksheet!F20","v":0},{"$f":"Worksheet!G20","v":0},null,null,null,null,{"$f":"Worksheet!AA20","v":0},{"$f":"IF(ISBLANK(Worksheet!Y20)=FALSE,Worksheet!Y20,\"\")","v":""},{"$f":"IFERROR(IF(ISBLANK(Worksheet!$Y20)=FALSE,Worksheet!AG20/Worksheet!$Y20,Worksheet!AH20/Worksheet!$Z20),\"\")","v":""},{"$f":"IFERROR(IF(ISBLANK(Worksheet!$Y20)=FALSE,Worksheet!AE20/Worksheet!$Y20,Worksheet!AF20/Worksheet!$Z20),\"\")","v":""},{"$f":"IFERROR(IF(ISBLANK(Worksheet!$Y20)=FALSE,Worksheet!AI20/Worksheet!$Y20,Worksheet!AJ20/Worksheet!$Z20),\"\")","v":""},{"$f":"IFERROR(IF(ISBLANK(Worksheet!$Y20)=FALSE,Worksheet!AK20/Worksheet!$Y20,Worksheet!AL20/Worksheet!$Z20),\"\")","v":""},{"$f":"IFERROR(IF(ISBLANK(Worksheet!$Y20)=FALSE,Worksheet!AM20/Worksheet!$Y20,Worksheet!AN20/Worksheet!$Z20),\"\")","v":""},null,null,null,{"$f":"IF(ISBLANK(Worksheet!Z20)=FALSE,Worksheet!Z20,\"\")","v":""},{"$f":"IF(Worksheet!$A$10=TRUE,\"Y\",\"N\")","v":"N"},{"$f":"IF(Worksheet!$A$11=TRUE,\"Y\",\"N\")","v":"N"},{"$f":"IF(Worksheet!$C$10=TRUE,\"Y\",\"N\")","v":"N"},{"$f":"IF(Worksheet!$C$11=TRUE,\"Y\",\"N\")","v":"N"},{"$f":"IF(Worksheet!$D$10=TRUE,\"Y\",\"N\")","v":"N"},{"$f":"IF(Worksheet!$D$11=TRUE,\"Y\",\"N\")","v":"N"},{"$f":"IFERROR(Worksheet!AB20,\"\")","v":0}]
[{"$f":"IF(Worksheet!$C21<>\"\",VLOOKUP(Worksheet!D21,'Incentive Structure'!$C$4:$D$24,2,FALSE),\"\")","v":""},{"$f":"Worksheet!F21","v":0},{"$f":"Worksheet!G21","v":0},null,null,null,null,{"$f":"Worksheet!AA21","v":0},{"$f":"IF(ISBLANK(Worksheet!Y21)=FALSE,Worksheet!Y21,\"\")","v":""},{"$f":"IFERROR(IF(ISBLANK(Worksheet!$Y21)=FALSE,Worksheet!AG21/Worksheet!$Y21,Worksheet!AH21/Worksheet!$Z21),\"\")","v":""},{"$f":"IFERROR(IF(ISBLANK(Worksheet!$Y21)=FALSE,Worksheet!AE21/Worksheet!$Y21,Worksheet!AF21/Worksheet!$Z21),\"\")","v":""},{"$f":"IFERROR(IF(ISBLANK(Worksheet!$Y21)=FALSE,Worksheet!AI21/Worksheet!$Y21,Worksheet!AJ21/Worksheet!$Z21),\"\")","v":""},{"$f":"IFERROR(IF(ISBLANK(Worksheet!$Y21)=FALSE,Worksheet!AK21/Worksheet!$Y21,Worksheet!AL21/Worksheet!$Z21),\"\")","v":""},{"$f":"IFERROR(IF(ISBLANK(Worksheet!$Y21)=FALSE,Worksheet!AM21/Worksheet!$Y21,Worksheet!AN21/Worksheet!$Z21),\"\")","v":""},null,null,null,{"$f":"IF(ISBLANK(Worksheet!Z21)=FALSE,Worksheet!Z21,\"\")","v":""},{"$f":"IF(Worksheet!$A$10=TRUE,\"Y\",\"N\")","v":"N"},{"$f":"IF(Worksheet!$A$11=TRUE,\"Y\",\"N\")","v":"N"},{"$f":"IF(Worksheet!$C$10=TRUE,\"Y\",\"N\")","v":"N"},{"$f":"IF(Worksheet!$C$11=TRUE,\"Y\",\"N\")","v":"N"},{"$f":"IF(Worksheet!$D$10=TRUE,\"Y\",\"N\")","v":"N"},{"$f":"IF(Worksheet!$D$11=TRUE,\"Y\",\"N\")","v":"N"},{"$f":"IFERROR(Worksheet!AB21,\"\")","v":0}]
[{"$f":"IF(Worksheet!$C22<>\"\",VLOOKUP(Worksheet!D22,'Incentive Structure'!$C$4:$D$24,2,FALSE),\"\")","v":""},{"$f":"Worksheet!F22","v":0},{"$f":"Worksheet!G22","v":0},null,null,null,null,{"$f":"Worksheet!AA22","v":0},{"$f":"IF(ISBLANK(Worksheet!Y22)=FALSE,Worksheet!Y22,\"\")","v":""},{"$f":"IFERROR(IF(ISBLANK(Worksheet!$Y22)=FALSE,Worksheet!AG22/Worksheet!$Y22,Worksheet!AH22/Worksheet!$Z22),\"\")","v":""},{"$f":"IFERROR(IF(ISBLANK(Worksheet!$Y22)=FALSE,Worksheet!AE22/Worksheet!$Y22,Worksheet!AF22/Worksheet!$Z22),\"\")","v":""},{"$f":"IFERROR(IF(ISBLANK(Worksheet!$Y22)=FALSE,Worksheet!AI22/Worksheet!$Y22,Worksheet!AJ22/Worksheet!$Z22),\"\")","v":""},{"$f":"IFERROR(IF(ISBLANK(Worksheet!$Y22)=FALSE,Worksheet!AK22/Worksheet!$Y22,Worksheet!AL22/Worksheet!$Z22),\"\")","v":""},{"$f":"IFERROR(IF(ISBLANK(Worksheet!$Y22)=FALSE,Worksheet!AM22/Worksheet!$Y22,Worksheet!AN22/Worksheet!$Z22),\"\")","v":""},null,null,null,{"$f":"IF(ISBLANK(Worksheet!Z22)=FALSE,Worksheet!Z22,\"\")","v":""},{"$f":"IF(Worksheet!$A$10=TRUE,\"Y\",\"N\")","v":"N"},{"$f":"IF(Worksheet!$A$11=TRUE,\"Y\",\"N\")","v":"N"},{"$f":"IF(Worksheet!$C$10=TRUE,\"Y\",\"N\")","v":"N"},{"$f":"IF(Worksheet!$C$11=TRUE,\"Y\",\"N\")","v":"N"},{"$f":"IF(Worksheet!$D$10=TRUE,\"Y\",\"N\")","v":"N"},{"$f":"IF(Worksheet!$D$11=TRUE,\"Y\",\"N\")","v":"N"},{"$f":"IFERROR(Worksheet!AB22,\"\")","v":0}]
{"$rows_left_out":18}
{"sheet":"Version","index":6,"n_rows":10,"n_cols":2,"rows_kept":10,"cut":false,"hidden":true,"merged":[]}
[14,"<- Version"]
[]
["Log"]
["2013-04-23","Updated with more granular measure breakdown per AEG's measures"]
["2013-07-09","no change for V7, skipped V6"]
["2013-07-16","fixed incentive lookup table to distinguish between different types of cooling applications"]
["2013-09-19","fixed incentive lookup table which had lots of mistakes in the cooking section"]
["2018-06-26","Updated to align with FY19 Protocols"]
["2019-07-01","Added Enhanced Incentive Eligibility Section and Updated for FY20 Program"]
["2020-10-01","Updated for FY21 Program"]