{"text_format":"1","workbook":"xlsx","n_sheets":5,"sheets":["Worksheet","Measure Codes","Table","Export","Version"],"not_rendered":{"charts":0,"images":0,"macros":1,"external_links":0,"defined_names":5,"comments":1,"pivot_tables":0},"unopened":[],"bounds":{"document_bytes":16777216,"sheet_cells":100000,"rows_first":2000,"rows_last":500,"rows_between":2000,"halvings":0,"cell_chars":16384,"cell_head_chars":4096},"cells_cut":0,"cells_raw":0,"read":"whole","date_system":"1900"}

{"sheet":"Worksheet","index":0,"n_rows":44,"n_cols":43,"rows_kept":44,"cut":false,"hidden":false,"merged":[[4,35,4,37],[5,27,5,28],[2,2,2,7],[5,32,8,34],[5,35,8,37],[3,2,3,7],[4,32,4,34],[14,6,15,6],[13,19,15,19],[13,20,15,20],[16,23,17,23],[12,10,12,12],[6,2,6,7],[6,10,6,12],[7,2,7,3],[7,10,7,11],[13,10,14,10],[14,13,15,13],[13,18,15,18],[13,5,13,9],[14,9,16,9],[17,9,18,9],[14,5,17,5],[13,22,15,22],[15,14,18,14],[15,11,18,11],[13,38,15,38],[13,13,13,14],[13,12,14,12],[15,12,16,12],[13,15,14,15],[13,16,14,16],[16,21,17,21],[13,28,14,28],[13,35,15,35],[13,36,15,36],[13,29,15,29],[13,17,14,17],[13,21,15,21],[13,30,15,30],[13,23,15,23],[13,24,16,24],[13,25,14,25],[13,26,14,26],[13,27,14,27],[13,37,15,37],[13,31,15,31],[13,32,15,32],[13,33,15,33],[13,34,15,34],[13,11,14,11],[14,7,17,7],[14,8,16,8],[17,8,18,8],[0,0,0,5],[13,0,18,0],[14,2,17,2],[1,17,1,19],[2,17,2,19],[5,29,5,30],[12,2,12,7],[2,10,2,12]]}
["FY23 SmartStart New Construction - Electric Unitary HVAC v1.0",null,null,null,null,null,"Incentive amounts are estimates until verified by the Program Manager."]
["Customer Information",null,null,null,null,null,null,null,null,null,null,null,null,null,null,null,null,"Total Units Committed:",null,null,{"$f":"SUM($P20:$P44)","v":0}]
["Name",null,null,null,null,null,null,null,null,"Address",null,null,null,null,null,null,null,"Total Units Installed:",null,null,{"$f":"SUM($Q20:$Q44)","v":0}]
["Contact",null,null,null,null,null,null,null,null,"Date"]
[null,null,null,null,null,null,null,null,null,null,null,null,null,null,null,null,null,null,null,null,null,null,null,null,null,null,null,null,null,null,null,null,"Pre-Inspection Notes",null,null,"Post-Inspection Notes"]
["Contractor/Vendor Information",null,null,null,null,null,null,null,null,null,null,null,null,null,null,null,null,null,null,null,null,null,null,null,null,null,null,"Inspection Type"]
["Name",null,null,null,null,null,null,null,null,"Address"]
["Contact",null,null,null,null,null,null," ",null,"Phone"]
["Enhanced Incentive Eligibility"]
[false,null,false,false]
{"$rows_left_out":35}
{"sheet":"Measure Codes","index":1,"n_rows":70,"n_cols":24,"rows_kept":70,"cut":false,"hidden":true,"merged":[]}
["Measure Code","Type Abbreviation","System Type","Min Capacity (BTUh","Max Capacity (BTUh","Baseline SEER","Baseline HSPF","Baseline EER","Baseline IEER","Baseline COP","Min Qualifying SEER\nEB","Min Qualifying SEER\nNC","Min Qualifying HSPF\nEB","Min Qualifying HSPF\nNC","Min Qualifying EER\nEB","Min Qualifying EER\nNC","Min Qualifying IEER\nEB","Min Qualifying IEER\nNC","Min Qualifying COP\nEB","Min Qualifying COP\nNC","Incentive per Ton\nEB","Incentive per Ton\nNC","Measure Life","Tier"]
["HVAC1","S","Split System - S",1,64999,13,"N/A","N/A","N/A","N/A",14,14,"N/A","N/A","N/A","N/A","N/A","N/A","N/A","N/A",92,92,15,1]
["HVAC2","S","Split System - S",1,64999,13,"N/A","N/A","N/A","N/A",16,16,"N/A","N/A","N/A","N/A","N/A","N/A","N/A","N/A",105,105,15,2]
["HVAC3","P","Single Package - P",1,64999,14,"N/A","N/A","N/A","N/A",14.3,14.3,"N/A","N/A","N/A","N/A","N/A","N/A","N/A","N/A",92,92,15,1]
["HVAC4","P","Single Package - P",1,64999,14,"N/A","N/A","N/A","N/A",16,16,"N/A","N/A","N/A","N/A","N/A","N/A","N/A","N/A",103,103,15,2]
["HVAC5","S/P","Split System - S or Single Package - P",65000,134999,"N/A","N/A",11,12.7,"N/A","N/A","N/A","N/A","N/A",11.5,11.5,13,13,"N/A","N/A",73,73,15,1]
["HVAC6","S/P","Split System - S or Single Package - P",65000,134999,"N/A","N/A",11,12.7,"N/A","N/A","N/A","N/A","N/A",12.5,12.5,14,14,"N/A","N/A",79,79,15,2]
["HVAC7","S/P","Split System - S or Single Package - P",135000,239999,"N/A","N/A",10.8,12.2,"N/A","N/A","N/A","N/A","N/A",11.5,11.5,12.4,12.4,"N/A","N/A",79,79,15,1]
["HVAC8","S/P","Split System - S or Single Package - P",135000,239999,"N/A","N/A",10.8,12.2,"N/A","N/A","N/A","N/A","N/A",12,12,14,14,"N/A","N/A",89,89,15,2]
["HVAC9","D","Central DX AC - D",240000,759999,"N/A","N/A",9.8000000000000007,11.4,"N/A","N/A","N/A","N/A","N/A",10.5,10.5,11.6,11.6,"N/A","N/A",79,79,15,1]
{"$rows_left_out":61}
{"sheet":"Table","index":2,"n_rows":29,"n_cols":3,"rows_kept":29,"cut":false,"hidden":true,"merged":[]}
["Facility Type","Heating EFLHh","Cooling EFLHc"]
["Assembly",603,669]
["Auto repair",1910,426]
["Dormitory",465,800]
["Hospital",3366,1424]
["Light industrial",714,549]
["Lodging – Hotel",1077,2918]
["Lodging – Motel",619,1233]
["Office – large",2034,720]
["Office – small",431,955]
{"$rows_left_out":20}
{"sheet":"Export","index":3,"n_rows":26,"n_cols":25,"rows_kept":26,"cut":false,"hidden":true,"merged":[]}
["Measure Type","Manufacturer","Model","Capacity/Size","Capacity/Size Units","EER Efficiency","SEER Efficiency","Incentive Per Unit","Quantity Committed","Annual Electricity Savings","Peak Demand Reduction","Lifetime Electricity Savings","Annual Gas Savings","Lifetime Gas Savings","Efficiency- other","Efficiency- other-type","Measure ID removed","Quantity Installed","Project in UEZ","Project in OZ","Municipality","K-12 School","County","Affordable Housing","Enhanced Incentive per Unit"]
[{"$f":"IF(Worksheet!R20=0,\"\",IF(OR(Worksheet!C20=\"AS\",Worksheet!C20=\"AP\")=TRUE,74,IF(Worksheet!C20=\"E\",340,IF(Worksheet!C20=\"D\",77,IF(OR(Worksheet!C20=\"PTAC\",Worksheet!C20=\"PTHP\")=TRUE,75,IF(Worksheet!C20=\"W\",78,IF(Worksheet!C20=\"O\",222,73)))))))","v":""},{"$f":"IF(ISBLANK(Worksheet!D20)=FALSE,Worksheet!D20,\"\")","v":""},{"$f":"IF(ISBLANK(Worksheet!E20)=FALSE,Worksheet!E20,\"\")","v":""},{"$f":"Worksheet!K20","v":0},"Btuh",{"$f":"IF(Worksheet!K20>=65000,Worksheet!L20,\"\")","v":""},{"$f":"IF(Worksheet!K20<65000,Worksheet!L20,\"\")","v":0},{"$f":"Worksheet!R20","v":0},{"$f":"IF(ISBLANK(Worksheet!P20)=FALSE,Worksheet!P20,\"\")","v":""},{"$f":"Worksheet!AB20","v":0},{"$f":"Worksheet!Y20","v":0},{"$f":"IFERROR(Worksheet!AJ20/I2,\"\")","v":""},{"$f":"IF(ISBLANK($I2),\"\",IFERROR(Worksheet!AH20/$I2,\"\"))","v":""},{"$f":"IF(ISBLANK($I2),\"\",IFERROR(Worksheet!AL20/$I2,\"\"))","v":""},null,null,null,{"$f":"IF(ISBLANK(Worksheet!Q20)=FALSE,Worksheet!Q20,\"\")","v":""},{"$f":"IF(Worksheet!$A$10=TRUE,\"Y\",\"N\")","v":"N"},{"$f":"IF(Worksheet!$A$11=TRUE,\"Y\",\"N\")","v":"N"},{"$f":"IF(Worksheet!$C$10=TRUE,\"Y\",\"N\")","v":"N"},{"$f":"IF(Worksheet!$C$11=TRUE,\"Y\",\"N\")","v":"N"},{"$f":"IF(Worksheet!$D$10=TRUE,\"Y\",\"N\")","v":"N"},{"$f":"IF(Worksheet!$D$11=TRUE,\"Y\",\"N\")","v":"N"},{"$f":"IFERROR(Worksheet!S20,\"\")","v":0}]
[{"$f":"IF(Worksheet!R21=0,\"\",IF(OR(Worksheet!C21=\"AS\",Worksheet!C21=\"AP\")=TRUE,74,IF(Worksheet!C21=\"E\",340,IF(Worksheet!C21=\"D\",77,IF(OR(Worksheet!C21=\"PTAC\",Worksheet!C21=\"PTHP\")=TRUE,75,IF(Worksheet!C21=\"W\",78,IF(Worksheet!C21=\"O\",222,73)))))))","v":""},{"$f":"IF(ISBLANK(Worksheet!D21)=FALSE,Worksheet!D21,\"\")","v":""},{"$f":"IF(ISBLANK(Worksheet!E21)=FALSE,Worksheet!E21,\"\")","v":""},{"$f":"Worksheet!K21","v":0},"Btuh",{"$f":"IF(Worksheet!K21>=65000,Worksheet!L21,\"\")","v":""},{"$f":"IF(Worksheet!K21<65000,Worksheet!L21,\"\")","v":0},{"$f":"Worksheet!R21","v":0},{"$f":"IF(ISBLANK(Worksheet!P21)=FALSE,Worksheet!P21,\"\")","v":""},{"$f":"Worksheet!AB21","v":0},{"$f":"Worksheet!Y21","v":0},{"$f":"IFERROR(Worksheet!AJ21/I3,\"\")","v":""},{"$f":"IF(ISBLANK($I3),\"\",IFERROR(Worksheet!AH21/$I3,\"\"))","v":""},{"$f":"IF(ISBLANK($I3),\"\",IFERROR(Worksheet!AL21/$I3,\"\"))","v":""},null,null,null,{"$f":"IF(ISBLANK(Worksheet!Q21)=FALSE,Worksheet!Q21,\"\")","v":""},{"$f":"IF(Worksheet!$A$10=TRUE,\"Y\",\"N\")","v":"N"},{"$f":"IF(Worksheet!$A$11=TRUE,\"Y\",\"N\")","v":"N"},{"$f":"IF(Worksheet!$C$10=TRUE,\"Y\",\"N\")","v":"N"},{"$f":"IF(Worksheet!$C$11=TRUE,\"Y\",\"N\")","v":"N"},{"$f":"IF(Worksheet!$D$10=TRUE,\"Y\",\"N\")","v":"N"},{"$f":"IF(Worksheet!$D$11=TRUE,\"Y\",\"N\")","v":"N"},{"$f":"IFERROR(Worksheet!S21,\"\")","v":0}]
[{"$f":"IF(Worksheet!R22=0,\"\",IF(OR(Worksheet!C22=\"AS\",Worksheet!C22=\"AP\")=TRUE,74,IF(Worksheet!C22=\"E\",340,IF(Worksheet!C22=\"D\",77,IF(OR(Worksheet!C22=\"PTAC\",Worksheet!C22=\"PTHP\")=TRUE,75,IF(Worksheet!C22=\"W\",78,IF(Worksheet!C22=\"O\",222,73)))))))","v":""},{"$f":"IF(ISBLANK(Worksheet!D22)=FALSE,Worksheet!D22,\"\")","v":""},{"$f":"IF(ISBLANK(Worksheet!E22)=FALSE,Worksheet!E22,\"\")","v":""},{"$f":"Worksheet!K22","v":0},"Btuh",{"$f":"IF(Worksheet!K22>=65000,Worksheet!L22,\"\")","v":""},{"$f":"IF(Worksheet!K22<65000,Worksheet!L22,\"\")","v":0},{"$f":"Worksheet!R22","v":0},{"$f":"IF(ISBLANK(Worksheet!P22)=FALSE,Worksheet!P22,\"\")","v":""},{"$f":"Worksheet!AB22","v":0},{"$f":"Worksheet!Y22","v":0},{"$f":"IFERROR(Worksheet!AJ22/I4,\"\")","v":""},{"$f":"IF(ISBLANK($I4),\"\",IFERROR(Worksheet!AH22/$I4,\"\"))","v":""},{"$f":"IF(ISBLANK($I4),\"\",IFERROR(Worksheet!AL22/$I4,\"\"))","v":""},null,null,null,{"$f":"IF(ISBLANK(Worksheet!Q22)=FALSE,Worksheet!Q22,\"\")","v":""},{"$f":"IF(Worksheet!$A$10=TRUE,\"Y\",\"N\")","v":"N"},{"$f":"IF(Worksheet!$A$11=TRUE,\"Y\",\"N\")","v":"N"},{"$f":"IF(Worksheet!$C$10=TRUE,\"Y\",\"N\")","v":"N"},{"$f":"IF(Worksheet!$C$11=TRUE,\"Y\",\"N\")","v":"N"},{"$f":"IF(Worksheet!$D$10=TRUE,\"Y\",\"N\")","v":"N"},{"$f":"IF(Worksheet!$D$11=TRUE,\"Y\",\"N\")","v":"N"},{"$f":"IFERROR(Worksheet!S22,\"\")","v":0}]
[{"$f":"IF(Worksheet!R23=0,\"\",IF(OR(Worksheet!C23=\"AS\",Worksheet!C23=\"AP\")=TRUE,74,IF(Worksheet!C23=\"E\",340,IF(Worksheet!C23=\"D\",77,IF(OR(Worksheet!C23=\"PTAC\",Worksheet!C23=\"PTHP\")=TRUE,75,IF(Worksheet!C23=\"W\",78,IF(Worksheet!C23=\"O\",222,73)))))))","v":""},{"$f":"IF(ISBLANK(Worksheet!D23)=FALSE,Worksheet!D23,\"\")","v":""},{"$f":"IF(ISBLANK(Worksheet!E23)=FALSE,Worksheet!E23,\"\")","v":""},{"$f":"Worksheet!K23","v":0},"Btuh",{"$f":"IF(Worksheet!K23>=65000,Worksheet!L23,\"\")","v":""},{"$f":"IF(Worksheet!K23<65000,Worksheet!L23,\"\")","v":0},{"$f":"Worksheet!R23","v":0},{"$f":"IF(ISBLANK(Worksheet!P23)=FALSE,Worksheet!P23,\"\")","v":""},{"$f":"Worksheet!AB23","v":0},{"$f":"Worksheet!Y23","v":0},{"$f":"IFERROR(Worksheet!AJ23/I5,\"\")","v":""},{"$f":"IF(ISBLANK($I5),\"\",IFERROR(Worksheet!AH23/$I5,\"\"))","v":""},{"$f":"IF(ISBLANK($I5),\"\",IFERROR(Worksheet!AL23/$I5,\"\"))","v":""},null,null,null,{"$f":"IF(ISBLANK(Worksheet!Q23)=FALSE,Worksheet!Q23,\"\")","v":""},{"$f":"IF(Worksheet!$A$10=TRUE,\"Y\",\"N\")","v":"N"},{"$f":"IF(Worksheet!$A$11=TRUE,\"Y\",\"N\")","v":"N"},{"$f":"IF(Worksheet!$C$10=TRUE,\"Y\",\"N\")","v":"N"},{"$f":"IF(Worksheet!$C$11=TRUE,\"Y\",\"N\")","v":"N"},{"$f":"IF(Worksheet!$D$10=TRUE,\"Y\",\"N\")","v":"N"},{"$f":"IF(Worksheet!$D$11=TRUE,\"Y\",\"N\")","v":"N"},{"$f":"IFERROR(Worksheet!S23,\"\")","v":0}]
[{"$f":"IF(Worksheet!R24=0,\"\",IF(OR(Worksheet!C24=\"AS\",Worksheet!C24=\"AP\")=TRUE,74,IF(Worksheet!C24=\"E\",340,IF(Worksheet!C24=\"D\",77,IF(OR(Worksheet!C24=\"PTAC\",Worksheet!C24=\"PTHP\")=TRUE,75,IF(Worksheet!C24=\"W\",78,IF(Worksheet!C24=\"O\",222,73)))))))","v":""},{"$f":"IF(ISBLANK(Worksheet!D24)=FALSE,Worksheet!D24,\"\")","v":""},{"$f":"IF(ISBLANK(Worksheet!E24)=FALSE,Worksheet!E24,\"\")","v":""},{"$f":"Worksheet!K24","v":0},"Btuh",{"$f":"IF(Worksheet!K24>=65000,Worksheet!L24,\"\")","v":""},{"$f":"IF(Worksheet!K24<65000,Worksheet!L24,\"\")","v":0},{"$f":"Worksheet!R24","v":0},{"$f":"IF(ISBLANK(Worksheet!P24)=FALSE,Worksheet!P24,\"\")","v":""},{"$f":"Worksheet!AB24","v":0},{"$f":"Worksheet!Y24","v":0},{"$f":"IFERROR(Worksheet!AJ24/I6,\"\")","v":""},{"$f":"IF(ISBLANK($I6),\"\",IFERROR(Worksheet!AH24/$I6,\"\"))","v":""},{"$f":"IF(ISBLANK($I6),\"\",IFERROR(Worksheet!AL24/$I6,\"\"))","v":""},null,null,null,{"$f":"IF(ISBLANK(Worksheet!Q24)=FALSE,Worksheet!Q24,\"\")","v":""},{"$f":"IF(Worksheet!$A$10=TRUE,\"Y\",\"N\")","v":"N"},{"$f":"IF(Worksheet!$A$11=TRUE,\"Y\",\"N\")","v":"N"},{"$f":"IF(Worksheet!$C$10=TRUE,\"Y\",\"N\")","v":"N"},{"$f":"IF(Worksheet!$C$11=TRUE,\"Y\",\"N\")","v":"N"},{"$f":"IF(Worksheet!$D$10=TRUE,\"Y\",\"N\")","v":"N"},{"$f":"IF(Worksheet!$D$11=TRUE,\"Y\",\"N\")","v":"N"},{"$f":"IFERROR(Worksheet!S24,\"\")","v":0}]
[{"$f":"IF(Worksheet!R25=0,\"\",IF(OR(Worksheet!C25=\"AS\",Worksheet!C25=\"AP\")=TRUE,74,IF(Worksheet!C25=\"E\",340,IF(Worksheet!C25=\"D\",77,IF(OR(Worksheet!C25=\"PTAC\",Worksheet!C25=\"PTHP\")=TRUE,75,IF(Worksheet!C25=\"W\",78,IF(Worksheet!C25=\"O\",222,73)))))))","v":""},{"$f":"IF(ISBLANK(Worksheet!D25)=FALSE,Worksheet!D25,\"\")","v":""},{"$f":"IF(ISBLANK(Worksheet!E25)=FALSE,Worksheet!E25,\"\")","v":""},{"$f":"Worksheet!K25","v":0},"Btuh",{"$f":"IF(Worksheet!K25>=65000,Worksheet!L25,\"\")","v":""},{"$f":"IF(Worksheet!K25<65000,Worksheet!L25,\"\")","v":0},{"$f":"Worksheet!R25","v":0},{"$f":"IF(ISBLANK(Worksheet!P25)=FALSE,Worksheet!P25,\"\")","v":""},{"$f":"Worksheet!AB25","v":0},{"$f":"Worksheet!Y25","v":0},{"$f":"IFERROR(Worksheet!AJ25/I7,\"\")","v":""},{"$f":"IF(ISBLANK($I7),\"\",IFERROR(Worksheet!AH25/$I7,\"\"))","v":""},{"$f":"IF(ISBLANK($I7),\"\",IFERROR(Worksheet!AL25/$I7,\"\"))","v":""},null,null,null,{"$f":"IF(ISBLANK(Worksheet!Q25)=FALSE,Worksheet!Q25,\"\")","v":""},{"$f":"IF(Worksheet!$A$10=TRUE,\"Y\",\"N\")","v":"N"},{"$f":"IF(Worksheet!$A$11=TRUE,\"Y\",\"N\")","v":"N"},{"$f":"IF(Worksheet!$C$10=TRUE,\"Y\",\"N\")","v":"N"},{"$f":"IF(Worksheet!$C$11=TRUE,\"Y\",\"N\")","v":"N"},{"$f":"IF(Worksheet!$D$10=TRUE,\"Y\",\"N\")","v":"N"},{"$f":"IF(Worksheet!$D$11=TRUE,\"Y\",\"N\")","v":"N"},{"$f":"IFERROR(Worksheet!S25,\"\")","v":0}]
[{"$f":"IF(Worksheet!R26=0,\"\",IF(OR(Worksheet!C26=\"AS\",Worksheet!C26=\"AP\")=TRUE,74,IF(Worksheet!C26=\"E\",340,IF(Worksheet!C26=\"D\",77,IF(OR(Worksheet!C26=\"PTAC\",Worksheet!C26=\"PTHP\")=TRUE,75,IF(Worksheet!C26=\"W\",78,IF(Worksheet!C26=\"O\",222,73)))))))","v":""},{"$f":"IF(ISBLANK(Worksheet!D26)=FALSE,Worksheet!D26,\"\")","v":""},{"$f":"IF(ISBLANK(Worksheet!E26)=FALSE,Worksheet!E26,\"\")","v":""},{"$f":"Worksheet!K26","v":0},"Btuh",{"$f":"IF(Worksheet!K26>=65000,Worksheet!L26,\"\")","v":""},{"$f":"IF(Worksheet!K26<65000,Worksheet!L26,\"\")","v":0},{"$f":"Worksheet!R26","v":0},{"$f":"IF(ISBLANK(Worksheet!P26)=FALSE,Worksheet!P26,\"\")","v":""},{"$f":"Worksheet!AB26","v":0},{"$f":"Worksheet!Y26","v":0},{"$f":"IFERROR(Worksheet!AJ26/I8,\"\")","v":""},{"$f":"IF(ISBLANK($I8),\"\",IFERROR(Worksheet!AH26/$I8,\"\"))","v":""},{"$f":"IF(ISBLANK($I8),\"\",IFERROR(Worksheet!AL26/$I8,\"\"))","v":""},null,null,null,{"$f":"IF(ISBLANK(Worksheet!Q26)=FALSE,Worksheet!Q26,\"\")","v":""},{"$f":"IF(Worksheet!$A$10=TRUE,\"Y\",\"N\")","v":"N"},{"$f":"IF(Worksheet!$A$11=TRUE,\"Y\",\"N\")","v":"N"},{"$f":"IF(Worksheet!$C$10=TRUE,\"Y\",\"N\")","v":"N"},{"$f":"IF(Worksheet!$C$11=TRUE,\"Y\",\"N\")","v":"N"},{"$f":"IF(Worksheet!$D$10=TRUE,\"Y\",\"N\")","v":"N"},{"$f":"IF(Worksheet!$D$11=TRUE,\"Y\",\"N\")","v":"N"},{"$f":"IFERROR(Worksheet!S26,\"\")","v":0}]
[{"$f":"IF(Worksheet!R27=0,\"\",IF(OR(Worksheet!C27=\"AS\",Worksheet!C27=\"AP\")=TRUE,74,IF(Worksheet!C27=\"E\",340,IF(Worksheet!C27=\"D\",77,IF(OR(Worksheet!C27=\"PTAC\",Worksheet!C27=\"PTHP\")=TRUE,75,IF(Worksheet!C27=\"W\",78,IF(Worksheet!C27=\"O\",222,73)))))))","v":""},{"$f":"IF(ISBLANK(Worksheet!D27)=FALSE,Worksheet!D27,\"\")","v":""},{"$f":"IF(ISBLANK(Worksheet!E27)=FALSE,Worksheet!E27,\"\")","v":""},{"$f":"Worksheet!K27","v":0},"Btuh",{"$f":"IF(Worksheet!K27>=65000,Worksheet!L27,\"\")","v":""},{"$f":"IF(Worksheet!K27<65000,Worksheet!L27,\"\")","v":0},{"$f":"Worksheet!R27","v":0},{"$f":"IF(ISBLANK(Worksheet!P27)=FALSE,Worksheet!P27,\"\")","v":""},{"$f":"Worksheet!AB27","v":0},{"$f":"Worksheet!Y27","v":0},{"$f":"IFERROR(Worksheet!AJ27/I9,\"\")","v":""},{"$f":"IF(ISBLANK($I9),\"\",IFERROR(Worksheet!AH27/$I9,\"\"))","v":""},{"$f":"IF(ISBLANK($I9),\"\",IFERROR(Worksheet!AL27/$I9,\"\"))","v":""},null,null,null,{"$f":"IF(ISBLANK(Worksheet!Q27)=FALSE,Worksheet!Q27,\"\")","v":""},{"$f":"IF(Worksheet!$A$10=TRUE,\"Y\",\"N\")","v":"N"},{"$f":"IF(Worksheet!$A$11=TRUE,\"Y\",\"N\")","v":"N"},{"$f":"IF(Worksheet!$C$10=TRUE,\"Y\",\"N\")","v":"N"},{"$f":"IF(Worksheet!$C$11=TRUE,\"Y\",\"N\")","v":"N"},{"$f":"IF(Worksheet!$D$10=TRUE,\"Y\",\"N\")","v":"N"},{"$f":"IF(Worksheet!$D$11=TRUE,\"Y\",\"N\")","v":"N"},{"$f":"IFERROR(Worksheet!S27,\"\")","v":0}]
[{"$f":"IF(Worksheet!R28=0,\"\",IF(OR(Worksheet!C28=\"AS\",Worksheet!C28=\"AP\")=TRUE,74,IF(Worksheet!C28=\"E\",340,IF(Worksheet!C28=\"D\",77,IF(OR(Worksheet!C28=\"PTAC\",Worksheet!C28=\"PTHP\")=TRUE,75,IF(Worksheet!C28=\"W\",78,IF(Worksheet!C28=\"O\",222,73)))))))","v":""},{"$f":"IF(ISBLANK(Worksheet!D28)=FALSE,Worksheet!D28,\"\")","v":""},{"$f":"IF(ISBLANK(Worksheet!E28)=FALSE,Worksheet!E28,\"\")","v":""},{"$f":"Worksheet!K28","v":0},"Btuh",{"$f":"IF(Worksheet!K28>=65000,Worksheet!L28,\"\")","v":""},{"$f":"IF(Worksheet!K28<65000,Worksheet!L28,\"\")","v":0},{"$f":"Worksheet!R28","v":0},{"$f":"IF(ISBLANK(Worksheet!P28)=FALSE,Worksheet!P28,\"\")","v":""},{"$f":"Worksheet!AB28","v":0},{"$f":"Worksheet!Y28","v":0},{"$f":"IFERROR(Worksheet!AJ28/I10,\"\")","v":""},{"$f":"IF(ISBLANK($I10),\"\",IFERROR(Worksheet!AH28/$I10,\"\"))","v":""},{"$f":"IF(ISBLANK($I10),\"\",IFERROR(Worksheet!AL28/$I10,\"\"))","v":""},null,null,null,{"$f":"IF(ISBLANK(Worksheet!Q28)=FALSE,Worksheet!Q28,\"\")","v":""},{"$f":"IF(Worksheet!$A$10=TRUE,\"Y\",\"N\")","v":"N"},{"$f":"IF(Worksheet!$A$11=TRUE,\"Y\",\"N\")","v":"N"},{"$f":"IF(Worksheet!$C$10=TRUE,\"Y\",\"N\")","v":"N"},{"$f":"IF(Worksheet!$C$11=TRUE,\"Y\",\"N\")","v":"N"},{"$f":"IF(Worksheet!$D$10=TRUE,\"Y\",\"N\")","v":"N"},{"$f":"IF(Worksheet!$D$11=TRUE,\"Y\",\"N\")","v":"N"},{"$f":"IFERROR(Worksheet!S28,\"\")","v":0}]
{"$rows_left_out":17}
{"sheet":"Version","index":4,"n_rows":15,"n_cols":3,"rows_kept":15,"cut":false,"hidden":true,"merged":[]}
[14,"<-Version"]
[]
["Log"]
["1/1/2008 Baseline efficiencies updated to comply with new protocol"]
["12/1/2008 updated for measure tracking compatability"]
["7/13/2009 entered formula for baseline efficiency into \"n\"-column cells to reflect protocol."]
["10/18/2009 added separate Dual Enthalpy Control system in order for correct incentive to export"]
["(missed updates)"]
["2011-03-15",null,"fixed error in export tab where the quantity was left out in a certain row"]
["2012-01-13","V5","added fuel use economizers"]
{"$rows_left_out":5}