{"text_format":"1","workbook":"xlsx","n_sheets":5,"sheets":["Worksheet","Measure Codes","Table","Export","Version"],"not_rendered":{"charts":0,"images":0,"macros":1,"external_links":0,"defined_names":5,"comments":1,"pivot_tables":0},"unopened":[],"bounds":{"document_bytes":16777216,"sheet_cells":100000,"rows_first":2000,"rows_last":500,"rows_between":2000,"halvings":0,"cell_chars":16384,"cell_head_chars":4096},"cells_cut":0,"cells_raw":0,"read":"whole","date_system":"1900"}

{"sheet":"Worksheet","index":0,"n_rows":44,"n_cols":43,"rows_kept":44,"cut":false,"hidden":false,"merged":[[4,35,4,37],[5,27,5,28],[2,2,2,7],[5,32,8,34],[5,35,8,37],[3,2,3,7],[4,32,4,34],[14,6,15,6],[13,19,15,19],[13,20,15,20],[16,23,17,23],[12,10,12,12],[6,2,6,7],[6,10,6,12],[7,2,7,3],[7,10,7,11],[13,10,14,10],[14,13,15,13],[13,18,15,18],[13,5,13,9],[14,9,16,9],[17,9,18,9],[14,5,17,5],[13,22,15,22],[15,14,18,14],[15,11,18,11],[13,38,15,38],[13,13,13,14],[13,12,14,12],[15,12,16,12],[13,15,14,15],[13,16,14,16],[16,21,17,21],[13,28,14,28],[13,35,15,35],[13,36,15,36],[13,29,15,29],[13,17,14,17],[13,21,15,21],[13,30,15,30],[13,23,15,23],[13,24,16,24],[13,25,14,25],[13,26,14,26],[13,27,14,27],[13,37,15,37],[13,31,15,31],[13,32,15,32],[13,33,15,33],[13,34,15,34],[13,11,14,11],[14,7,17,7],[14,8,16,8],[17,8,18,8],[0,0,0,5],[13,0,18,0],[14,2,17,2],[1,17,1,19],[2,17,2,19],[5,29,5,30],[12,2,12,7],[2,10,2,12]]}
["FY23 SmartStart New Construction - Electric Unitary HVAC v1.0",null,null,null,null,null,"Incentive amounts are estimates until verified by the Program Manager."]
["Customer Information",null,null,null,null,null,null,null,null,null,null,null,null,null,null,null,null,"Total Units Committed:",null,null,{"$f":"SUM($P20:$P44)","v":0}]
["Name",null,null,null,null,null,null,null,null,"Address",null,null,null,null,null,null,null,"Total Units Installed:",null,null,{"$f":"SUM($Q20:$Q44)","v":0}]
["Contact",null,null,null,null,null,null,null,null,"Date"]
[null,null,null,null,null,null,null,null,null,null,null,null,null,null,null,null,null,null,null,null,null,null,null,null,null,null,null,null,null,null,null,null,"Pre-Inspection Notes",null,null,"Post-Inspection Notes"]
["Contractor/Vendor Information",null,null,null,null,null,null,null,null,null,null,null,null,null,null,null,null,null,null,null,null,null,null,null,null,null,null,"Inspection Type"]
["Name",null,null,null,null,null,null,null,null,"Address"]
["Contact",null,null,null,null,null,null," ",null,"Phone"]
["Enhanced Incentive Eligibility"]
[false,null,false,false]
[false,null,false,false,null,null,null,null,null,null,null,null,null,null,null,null,null,null,null,null,null,null,null,null,null,null,null,null,null,null,null,null,null,null,null,null,null,null,null,null,"Date","Inspector/Sign-off"]
[null,null,null,null,null,null,null,null,null,null,null,null,null,null,null,null,null,null,null,null,null,null,null,null,null,null,null,null,null,null,null,null,null,null,null,null,null,null,null,"Pre-Inspection"]
["Project Type",null,"New Construction",null,null,null,null,null,null,"Building Type",null,null,null,null,null,null,"Totals:",null,null,{"$f":"SUM(T20:T44)","v":0},{"$f":"SUM(U20:U44)","v":0},null,null,null,null,null,null,null,null,{"$f":"SUM(AD20:AD44)","v":0},0,0,0,0,0,0,0,0,0,"Post Inspection"]
["Measure Code","Reason","Type","Manufacturer","Model","Occ. Cont. T-Stat Only",null,null,null,null,"Unit Size Cooling","Unit Cooling Efficiency","AC & ASHP ≥ 65,000 Btuh Only","HP And Occ. Cont.T-Stat Only",null,"Quantity Committed","Quantity Installed","Incentive Per Unit","Enhanced Incentive Per Unit","Total Committed Incentive","Total Installed Incentive","Baseline Efficiency Cooling","Baseline Efficiency Cooling","Baseline Efficiency Heating","Peak Demand Savings per Unit","Annual Cooling  Savings per Unit","Annual Heating Savings per Unit","Total Annual Savings per Unit","Annual Heating Savings per Unit","Peak Demand Savings Committed","Peak Demand Savings Installed","Annual Energy Savings Committed","Annual Energy Savings\nInstalled","Annual Energy Savings Committed","Annual Energy Savings\nInstalled","Lifetime Energy Savings Committed","Lifetime Energy Savings\nInstalled","Lifetime Energy Savings Committed","Lifetime Energy Savings\nInstalled"]
[null,"N-New","<Hover over cell C12 for abbreviation definitions>",null,null,"Heating Season Facility Temp.","Heating Type","Cooling Season Facility Temp.","Weekly Occupied Hours","Number of hotel/hospitality units",null,null,null,"Unit Size Heating","Heating Efficiency",null,null,null,null,null,null,null,null,null,null,null,null,null,null,null,null,null,null,null,null,null,null,null,null,"FOUND PRE",null,"FOUND POST"]
[null,"R-Replaced",null,null,null,null,null,null,null,null,"(Btuh)","(SEER or EER)\n\n<Hover over cell L14 for units>","Unit Cooling Efficiency",null,"(HSPF, COP, AFUE, Et, or Ec)\n<Hover over cell N13 for units>",null,null,null,null,null,null,null,null,null,null,"(kWh)","(kWh)","(kWh)","(Therms)",null,null,null,null,null,null,null,null,null,null,"(Type)","Count","(Type)","Count"]
[null,null,null,null,null,null,"G - Gas",null,null,null,null,null,null,"(Btuh)",null,null,null,null,null,null,null,"(SEER or EER)","(IEER)","(HSPF or COP",null,null,null,null,null,"(kW)","(kW)","(kWh)","(kWh)","(Therms)","(Therms)","(kWh)","(kWh)","(Therms)","(Therms)"]
[null,null,null,null,null,null,"E - Electric",null,"(use 84 as default)","(total number of guest rooms)",null,null,"(IEER)",null,null,null,null,null,null,null,null,null,null,null,"(kW)"]
[null,null,null,null,null,"(°F) ","G - Gas","(°F) "]
[null,"N",{"$f":"IF(A20=\"\",\"\",VLOOKUP(A20,MeasureCode_Lookup,2,FALSE))","v":""},null,null,null,null,null,null,null,null,null,null,null,null,null,null,{"$f":"IF(OR($C$13=\"\",$K$13=\"\",A20=\"\",AND(C20=\"O\",OR(AND($K$13<>\"Dormitory\",$K$13<>\"Hospital\",$K$13<>\"Lodging – Hotel\",$K$13<>\"Lodging – Motel\")=TRUE,F20=\"\",G20=\"\",H20=\"\",I20=\"\", J20=\"\",AND($C$13=\"New Construction\",J20>50)=TRUE)=TRUE)=TRUE,K20=\"\",L20=\"\",AND(OR(C20=\"S\",C20=\"P\", C20=\"S/P\",C20=\"D\",C20=\"AP\",C20=\"AS\")=TRUE,K20>=65000,M20=\"\")=TRUE,AND(OR(C20=\"AP\",C20=\"AS\",C20=\"W\",C20=\"PTHP\",C20=\"PVHP\",C20=\"O\")=TRUE,OR(N20=\"\",O20=\"\")=TRUE)=TRUE)=TRUE,0,IF(OR(K20<VLOOKUP(A20,MeasureCode_Lookup,4,FALSE),K20>VLOOKUP(A20,MeasureCode_Lookup,5,FALSE),L20<IF(VLOOKUP(A20,MeasureCode_Lookup,11,FALSE)=\"N/A\",N(VLOOKUP(A20,MeasureCode_Lookup,IF($C$13=\"Existing Building\",15,16),FALSE)),N(VLOOKUP(A20,MeasureCode_Lookup,IF($C$13=\"Existing Building\",11,12),FALSE))),M20<N(VLOOKUP(A20,MeasureCode_Lookup,IF($C$13=\"Existing Building\",17,18),FALSE)),O20<IF(VLOOKUP(A20,MeasureCode_Lookup,13,FALSE)=\"N/A\",N(VLOOKUP(A20,MeasureCode_Lookup,IF($C$13=\"Existing Building\",19,20),FALSE)),N(VLOOKUP(A20,MeasureCode_Lookup,IF($C$13=\"Existing Building\",13,14),FALSE))))=TRUE,0,ROUND(VLOOKUP(A20,MeasureCode_Lookup,IF($C$13=\"Existing Building\",21,22),FALSE)*IF(OR(C20=\"E\",C20=\"O\")=TRUE,1,K20/12000),2)))","v":0},{"$f":"IF(OR($A$10=TRUE,$A$11=TRUE,$C$10=TRUE,$C$11=TRUE,$D$10=TRUE,$D$11=TRUE)=TRUE,R20,0)","v":0},{"$f":"IF(R20=0,0,P20*(R20+S20))","v":0},{"$f":"IF(R20=0,0,Q20*(R20+S20))","v":0},{"$f":"IF(R20=0,\"\",IF(OR(C20=\"O\",C20=\"E\")=TRUE,\"N/A\",IF(OR(C20=\"PTAC\",C20=\"PTHP\")=TRUE,14-(0.3*K20/1000),IF(VLOOKUP(A20,MeasureCode_Lookup,6,FALSE)=\"N/A\",VLOOKUP(A20,MeasureCode_Lookup,8,FALSE),VLOOKUP(A20,MeasureCode_Lookup,6,FALSE)))))","v":""},{"$f":"IF(R20=0,\"\",IF(OR(C20=\"O\",C20=\"E\")=TRUE,\"N/A\",VLOOKUP(A20,MeasureCode_Lookup,9,FALSE)))","v":""},{"$f":"IF(R20=0,\"\",IF(OR(C20=\"O\",C20=\"E\")=TRUE,\"N/A\",IF(C20=\"PTHP\",3.7-(0.052*N20/1000),IF(VLOOKUP(A20,MeasureCode_Lookup,7,FALSE)=\"N/A\",VLOOKUP(A20,MeasureCode_Lookup,10,FALSE),VLOOKUP(A20,MeasureCode_Lookup,7,FALSE)))))","v":""},{"$f":"IF(R20=0,0,IF(OR(C20=\"O\",C20=\"E\")=TRUE,0,(K20/1000)*((1/V20)-(1/L20))*0.5))","v":0},{"$f":"IF(R20=0,0,IF(C20=\"O\",(((H20*(I20+5)+(H20+5)*(168-(I20+5)))/168)-H20)*(0.06*K20/1000/L20),IF(C20=\"E\",(K20*0.13)/(L20*1000),(K20/1000)*((1/V20)-(1/L20))))*VLOOKUP($K$13,EFLH_Lookup,3,FALSE))","v":0},{"$f":"IF(R20=0,0,IF(C20=\"O\",IF(G20<>\"E\",0,(F20-(F20*(I20+5)+(F20-5)*(168-(I20+5)))/168)*(0.03*N20/1000/(O20*IF(K20<65000,1,3.412)))),IF(C20=\"E\",0,IF(OR(C20=\"AS\",C20=\"AP\",C20=\"W\",C20=\"PTHP\",C20=\"PVHP\")=TRUE,(N20/1000)*((1/(X20*IF(K20<65000,1,3.412)))-(1/(O20*IF(K20<65000,1,3.412)))),0)))*VLOOKUP($K$13,EFLH_Lookup,2,FALSE))","v":0},{"$f":"IF(R20=0,0,Z20+AA20)","v":0},{"$f":"IF(R20=0,0,IF(C20=\"O\",IF(G20<>\"G\",0,(F20-(F20*(I20+5)+(F20-5)*(168-(I20+5)))/168)*(0.03*N20*VLOOKUP($K$13,EFLH_Lookup,2,FALSE)/O20/100000)),0))","v":0},{"$f":"IF(R20=0,0,P20*Y20)","v":0},{"$f":"IF(R20=0,0,Q20*Y20)","v":0},{"$f":"IF(R20=0,0,P20*AB20)","v":0},{"$f":"IF(R20=0,0,Q20*AB20)","v":0},{"$f":"IF(R20=0,0,P20*AC20)","v":0},{"$f":"IF(R20=0,0,Q20*AC20)","v":0},{"$f":"IF(R20=0,0,AF20*VLOOKUP(A20,MeasureCode_Lookup,23,FALSE))","v":0},{"$f":"IF(R20=0,0,AG20*VLOOKUP(A20,MeasureCode_Lookup,23,FALSE))","v":0},{"$f":"IF(R20=0,0,AH20*VLOOKUP(A20,MeasureCode_Lookup,23,FALSE))","v":0},{"$f":"IF(R20=0,0,AI20*VLOOKUP(A20,MeasureCode_Lookup,23,FALSE))","v":0}]
[null,"N","",null,null,null,null,null,null,null,null,null,null,null,null,null,null,0,0,0,0,"","","",0,0,0,{"$f":"IF(R21=0,0,Z21+AA21)","v":0},0,0,0,0,0,0,0,0,0,0,0]
[null,"N","",null,null,null,null,null,null,null,null,null,null,null,null,null,null,0,0,0,0,"","","",0,0,0,0,0,0,0,0,0,0,0,0,0,0,0]
[null,"N","",null,null,null,null,null,null,null,null,null,null,null,null,null,null,0,0,0,0,"","","",0,0,0,0,0,0,0,0,0,0,0,0,0,0,0]
[null,"N","",null,null,null,null,null,null,null,null,null,null,null,null,null,null,0,0,0,0,"","","",0,0,0,0,0,0,0,0,0,0,0,0,0,0,0]
[null,"N","",null,null,null,null,null,null,null,null,null,null,null,null,null,null,0,0,0,0,"","","",0,0,0,0,0,0,0,0,0,0,0,0,0,0,0]
[null,"N","",null,null,null,null,null,null,null,null,null,null,null,null,null,null,0,0,0,0,"","","",0,0,0,0,0,0,0,0,0,0,0,0,0,0,0]
[null,"N","",null,null,null,null,null,null,null,null,null,null,null,null,null,null,0,0,0,0,"","","",0,0,0,0,0,0,0,0,0,0,0,0,0,0,0]
[null,"N","",null,null,null,null,null,null,null,null,null,null,null,null,null,null,0,0,0,0,"","","",0,0,0,0,0,0,0,0,0,0,0,0,0,0,0]
[null,"N","",null,null,null,null,null,null,null,null,null,null,null,null,null,null,0,0,0,0,"","","",0,0,0,0,0,0,0,0,0,0,0,0,0,0,0]
[null,"N","",null,null,null,null,null,null,null,null,null,null,null,null,null,null,0,0,0,0,"","","",0,0,0,0,0,0,0,0,0,0,0,0,0,0,0]
[null,"N","",null,null,null,null,null,null,null,null,null,null,null,null,null,null,0,0,0,0,"","","",0,0,0,0,0,0,0,0,0,0,0,0,0,0,0]
[null,"N","",null,null,null,null,null,null,null,null,null,null,null,null,null,null,0,0,0,0,"","","",0,0,0,0,0,0,0,0,0,0,0,0,0,0,0]
[null,"N","",null,null,null,null,null,null,null,null,null,null,null,null,null,null,0,0,0,0,"","","",0,0,0,0,0,0,0,0,0,0,0,0,0,0,0]
[null,"N","",null,null,null,null,null,null,null,null,null,null,null,null,null,null,0,0,0,0,"","","",0,0,0,0,0,0,0,0,0,0,0,0,0,0,0]
[null,"N","",null,null,null,null,null,null,null,null,null,null,null,null,null,null,0,0,0,0,"","","",0,0,0,0,0,0,0,0,0,0,0,0,0,0,0]
[null,"N","",null,null,null,null,null,null,null,null,null,null,null,null,null,null,0,0,0,0,"","","",0,0,0,0,0,0,0,0,0,0,0,0,0,0,0]
[null,"N","",null,null,null,null,null,null,null,null,null,null,null,null,null,null,0,0,0,0,"","","",0,0,0,0,0,0,0,0,0,0,0,0,0,0,0]
[null,"N","",null,null,null,null,null,null,null,null,null,null,null,null,null,null,0,0,0,0,"","","",0,0,0,0,0,0,0,0,0,0,0,0,0,0,0]
[null,"N","",null,null,null,null,null,null,null,null,null,null,null,null,null,null,0,0,0,0,"","","",0,0,0,0,0,0,0,0,0,0,0,0,0,0,0]
[null,"N","",null,null,null,null,null,null,null,null,null,null,null,null,null,null,0,0,0,0,"","","",0,0,0,0,0,0,0,0,0,0,0,0,0,0,0]
[null,"N","",null,null,null,null,null,null,null,null,null,null,null,null,null,null,0,0,0,0,"","","",0,0,0,0,0,0,0,0,0,0,0,0,0,0,0]
[null,"N","",null,null,null,null,null,null,null,null,null,null,null,null,null,null,0,0,0,0,"","","",0,0,0,0,0,0,0,0,0,0,0,0,0,0,0]
[null,"N","",null,null,null,null,null,null,null,null,null,null,null,null,null,null,0,0,0,0,"","","",0,0,0,0,0,0,0,0,0,0,0,0,0,0,0]
[null,"N","",null,null,null,null,null,null,null,null,null,null,null,null,null,null,0,0,0,0,"","","",0,0,0,0,0,0,0,0,0,0,0,0,0,0,0]

{"sheet":"Measure Codes","index":1,"n_rows":70,"n_cols":24,"rows_kept":70,"cut":false,"hidden":true,"merged":[]}
["Measure Code","Type Abbreviation","System Type","Min Capacity (BTUh","Max Capacity (BTUh","Baseline SEER","Baseline HSPF","Baseline EER","Baseline IEER","Baseline COP","Min Qualifying SEER\nEB","Min Qualifying SEER\nNC","Min Qualifying HSPF\nEB","Min Qualifying HSPF\nNC","Min Qualifying EER\nEB","Min Qualifying EER\nNC","Min Qualifying IEER\nEB","Min Qualifying IEER\nNC","Min Qualifying COP\nEB","Min Qualifying COP\nNC","Incentive per Ton\nEB","Incentive per Ton\nNC","Measure Life","Tier"]
["HVAC1","S","Split System - S",1,64999,13,"N/A","N/A","N/A","N/A",14,14,"N/A","N/A","N/A","N/A","N/A","N/A","N/A","N/A",92,92,15,1]
["HVAC2","S","Split System - S",1,64999,13,"N/A","N/A","N/A","N/A",16,16,"N/A","N/A","N/A","N/A","N/A","N/A","N/A","N/A",105,105,15,2]
["HVAC3","P","Single Package - P",1,64999,14,"N/A","N/A","N/A","N/A",14.3,14.3,"N/A","N/A","N/A","N/A","N/A","N/A","N/A","N/A",92,92,15,1]
["HVAC4","P","Single Package - P",1,64999,14,"N/A","N/A","N/A","N/A",16,16,"N/A","N/A","N/A","N/A","N/A","N/A","N/A","N/A",103,103,15,2]
["HVAC5","S/P","Split System - S or Single Package - P",65000,134999,"N/A","N/A",11,12.7,"N/A","N/A","N/A","N/A","N/A",11.5,11.5,13,13,"N/A","N/A",73,73,15,1]
["HVAC6","S/P","Split System - S or Single Package - P",65000,134999,"N/A","N/A",11,12.7,"N/A","N/A","N/A","N/A","N/A",12.5,12.5,14,14,"N/A","N/A",79,79,15,2]
["HVAC7","S/P","Split System - S or Single Package - P",135000,239999,"N/A","N/A",10.8,12.2,"N/A","N/A","N/A","N/A","N/A",11.5,11.5,12.4,12.4,"N/A","N/A",79,79,15,1]
["HVAC8","S/P","Split System - S or Single Package - P",135000,239999,"N/A","N/A",10.8,12.2,"N/A","N/A","N/A","N/A","N/A",12,12,14,14,"N/A","N/A",89,89,15,2]
["HVAC9","D","Central DX AC - D",240000,759999,"N/A","N/A",9.8000000000000007,11.4,"N/A","N/A","N/A","N/A","N/A",10.5,10.5,11.6,11.6,"N/A","N/A",79,79,15,1]
["HVAC10","D","Central DX AC - D",240000,759999,"N/A","N/A",9.8000000000000007,11.4,"N/A","N/A","N/A","N/A","N/A",11,11,12.5,12.5,"N/A","N/A",85,85,15,2]
["HVAC11","D","Central DX AC - D",760000,999999999,"N/A","N/A",9.5,11,"N/A","N/A","N/A","N/A","N/A",9.6999999999999993,9.6999999999999993,11.2,11.2,"N/A","N/A",72,72,15,1]
["HVAC12","D","Central DX AC - D",760000,999999999,"N/A","N/A",9.5,11,"N/A","N/A","N/A","N/A","N/A",10,10,12,12,"N/A","N/A",77,77,15,2]
["HVAC13","AS","Air Source Heat Pump (Split System) - AS",1,64999,14,8.1999999999999993,"N/A","N/A","N/A",14.3,14.3,8.4,8.4,"N/A","N/A","N/A","N/A","N/A","N/A",92,92,15,1]
["HVAC14","AS","Air Source Heat Pump (Split System) - AS",1,64999,14,8.1999999999999993,"N/A","N/A","N/A",15.5,15.5,8.5,8.5,"N/A","N/A","N/A","N/A","N/A","N/A",100,100,15,2]
["HVAC15","AP","Air Source Heat Pump (Single Package) - AP",1,64999,14,8,"N/A","N/A","N/A",14.3,14.3,8.1999999999999993,8.1999999999999993,"N/A","N/A","N/A","N/A","N/A","N/A",92,92,15,1]
["HVAC16","AP","Air Source Heat Pump (Single Package) - AP",1,64999,14,8,"N/A","N/A","N/A",15.5,15.5,8.5,8.5,"N/A","N/A","N/A","N/A","N/A","N/A",100,100,15,2]
["HVAC17","AS","Air Source Heat Pump (Split System) - AS",65000,134999,"N/A","N/A",10.8,11,3.3,"N/A","N/A","N/A","N/A",11.5,11.5,12.2,12.2,3.4,3.4,73,73,15,1]
["HVAC18","AS","Air Source Heat Pump (Split System) - AS",65000,134999,"N/A","N/A",10.8,11,3.3,"N/A","N/A","N/A","N/A",12.1,12.1,12.8,12.8,3.5,3.5,77,77,15,2]
["HVAC19","AS","Air Source Heat Pump (Split System) - AS",135000,239999,"N/A","N/A",10.4,11.4,3.2,"N/A","N/A","N/A","N/A",11.5,11.5,11.6,11.6,3.3,3.3,79,79,15,1]
["HVAC20","AS","Air Source Heat Pump (Split System) - AS",135000,239999,"N/A","N/A",10.4,11.4,3.2,"N/A","N/A","N/A","N/A",11.7,11.7,15,15,3.3,3.3,82,82,15,2]
["HVAC21","AS","Air Source Heat Pump (Split System) - AS",240000,999999999,"N/A","N/A",9.3000000000000007,10.4,3.2,"N/A","N/A","N/A","N/A",9.5,9.5,10.6,10.6,3.2,3.2,78,78,15,1]
["HVAC22","AS","Air Source Heat Pump (Split System) - AS",240000,999999999,"N/A","N/A",9.3000000000000007,10.4,3.2,"N/A","N/A","N/A","N/A",9.6999999999999993,9.6999999999999993,12,12,3.2,3.2,82,82,15,2]
["HVAC23","AP","Air Source Heat Pump (Single Package) - AP",65000,134999,"N/A","N/A",10.8,11,3.3,"N/A","N/A","N/A","N/A",11.5,11.5,12.2,12.2,3.4,3.4,73,73,15,1]
["HVAC24","AP","Air Source Heat Pump (Single Package) - AP",65000,134999,"N/A","N/A",10.8,11,3.3,"N/A","N/A","N/A","N/A",12.1,12.1,12.8,12.8,3.5,3.5,77,77,15,2]
["HVAC25","AP","Air Source Heat Pump (Single Package) - AP",135000,239999,"N/A","N/A",10.4,11.4,3.2,"N/A","N/A","N/A","N/A",11.5,11.5,11.6,11.6,3.3,3.3,79,79,15,1]
["HVAC26","AP","Air Source Heat Pump (Single Package) - AP",135000,239999,"N/A","N/A",10.4,11.4,3.2,"N/A","N/A","N/A","N/A",11.7,11.7,15,15,3.3,3.3,82,82,15,2]
["HVAC27","AP","Air Source Heat Pump (Single Package) - AP",240000,999999999,"N/A","N/A",9.3000000000000007,10.4,3.2,"N/A","N/A","N/A","N/A",9.5,9.5,10.6,10.6,3.2,3.2,79,79,15,1]
["HVAC28","AP","Air Source Heat Pump (Single Package) - AP",240000,999999999,"N/A","N/A",9.3000000000000007,10.4,3.2,"N/A","N/A","N/A","N/A",9.6999999999999993,9.6999999999999993,12,12,3.2,3.2,82,82,15,2]
["HVAC29","W","Water Source Heat Pump - W",1,16999,"N/A","N/A",12.2,"N/A",4.3,"N/A","N/A","N/A","N/A",12.4,12.4,"N/A","N/A",4.3,4.3,40,20,15,1]
["HVAC30","W","Water Source Heat Pump - W",1,16999,"N/A","N/A",12.2,"N/A",4.3,"N/A","N/A","N/A","N/A",14,14,"N/A","N/A",4.8,4.8,45,23,15,2]
["HVAC31","W","Water Source Heat Pump - W",17000,64999,"N/A","N/A",13,"N/A",4.3,"N/A","N/A","N/A","N/A",13.3,13.3,"N/A","N/A",4.3,4.3,60,30,15,1]
["HVAC32","W","Water Source Heat Pump - W",17000,64999,"N/A","N/A",13,"N/A",4.3,"N/A","N/A","N/A","N/A",15,15,"N/A","N/A",4.5,4.5,68,34,15,2]
["HVAC33","W","Water Source Heat Pump - W",65000,134999,"N/A","N/A",13,"N/A",4.3,"N/A","N/A","N/A","N/A",13.3,13.3,"N/A","N/A",4.3,4.3,80,40,15,1]
["HVAC34","W","Water Source Heat Pump - W",65000,134999,"N/A","N/A",13,"N/A",4.3,"N/A","N/A","N/A","N/A",15,15,"N/A","N/A",4.5,4.5,90,45,15,2]
["HVAC35","PTAC","Packaged Terminal AC - PTAC",1,6999,"N/A","N/A","Calc","N/A","N/A","N/A","N/A","N/A","N/A",12,12,"N/A","N/A","N/A","N/A",40,20,15,1]
["HVAC36","PTAC","Packaged Terminal AC - PTAC",7000,7999,"N/A","N/A","Calc","N/A","N/A","N/A","N/A","N/A","N/A",12,12,"N/A","N/A","N/A","N/A",40,20,15,1]
["HVAC37","PTAC","Packaged Terminal AC - PTAC",8000,8999,"N/A","N/A","Calc","N/A","N/A","N/A","N/A","N/A","N/A",11.7,11.7,"N/A","N/A","N/A","N/A",40,20,15,1]
["HVAC38","PTAC","Packaged Terminal AC - PTAC",9000,9999,"N/A","N/A","Calc","N/A","N/A","N/A","N/A","N/A","N/A",11.4,11.4,"N/A","N/A","N/A","N/A",40,20,15,1]
["HVAC39","PTAC","Packaged Terminal AC - PTAC",10000,10999,"N/A","N/A","Calc","N/A","N/A","N/A","N/A","N/A","N/A",11.1,11.1,"N/A","N/A","N/A","N/A",40,20,15,1]
["HVAC40","PTAC","Packaged Terminal AC - PTAC",11000,11999,"N/A","N/A","Calc","N/A","N/A","N/A","N/A","N/A","N/A",10.8,10.8,"N/A","N/A","N/A","N/A",40,20,15,1]
["HVAC41","PTAC","Packaged Terminal AC - PTAC",12000,12999,"N/A","N/A","Calc","N/A","N/A","N/A","N/A","N/A","N/A",10.5,10.5,"N/A","N/A","N/A","N/A",40,20,15,1]
["HVAC42","PTAC","Packaged Terminal AC - PTAC",13000,13999,"N/A","N/A","Calc","N/A","N/A","N/A","N/A","N/A","N/A",10.199999999999999,10.199999999999999,"N/A","N/A","N/A","N/A",40,20,15,1]
["HVAC43","PTAC","Packaged Terminal AC - PTAC",14000,14999,"N/A","N/A","Calc","N/A","N/A","N/A","N/A","N/A","N/A",9.9,9.9,"N/A","N/A","N/A","N/A",40,20,15,1]
["HVAC44","PTAC","Packaged Terminal AC - PTAC",15000,999999999,"N/A","N/A","Calc","N/A","N/A","N/A","N/A","N/A","N/A",9.6,9.6,"N/A","N/A","N/A","N/A",40,20,15,1]
["HVAC45","PTHP","Packaged Terminal HP - PTHP",1,6999,"N/A","N/A","Calc","N/A","Calc","N/A","N/A","N/A","N/A",12,12,"N/A","N/A",3.4,3.4,40,20,15,1]
["HVAC46","PTHP","Packaged Terminal HP - PTHP",7000,7999,"N/A","N/A","Calc","N/A","Calc","N/A","N/A","N/A","N/A",12,12,"N/A","N/A",3.4,3.4,40,20,15,1]
["HVAC47","PTHP","Packaged Terminal HP - PTHP",8000,8999,"N/A","N/A","Calc","N/A","Calc","N/A","N/A","N/A","N/A",11.7,11.7,"N/A","N/A",3.3,3.3,40,20,15,1]
["HVAC48","PTHP","Packaged Terminal HP - PTHP",9000,9999,"N/A","N/A","Calc","N/A","Calc","N/A","N/A","N/A","N/A",11.4,11.4,"N/A","N/A",3.3,3.3,40,20,15,1]
["HVAC49","PTHP","Packaged Terminal HP - PTHP",10000,10999,"N/A","N/A","Calc","N/A","Calc","N/A","N/A","N/A","N/A",11.1,11.1,"N/A","N/A",3.2,3.2,40,20,15,1]
["HVAC50","PTHP","Packaged Terminal HP - PTHP",11000,11999,"N/A","N/A","Calc","N/A","Calc","N/A","N/A","N/A","N/A",10.8,10.8,"N/A","N/A",3.2,3.2,40,20,15,1]
["HVAC51","PTHP","Packaged Terminal HP - PTHP",12000,12999,"N/A","N/A","Calc","N/A","Calc","N/A","N/A","N/A","N/A",10.5,10.5,"N/A","N/A",3.1,3.1,40,20,15,1]
["HVAC52","PTHP","Packaged Terminal HP - PTHP",13000,13999,"N/A","N/A","Calc","N/A","Calc","N/A","N/A","N/A","N/A",10.199999999999999,10.199999999999999,"N/A","N/A",3.1,3.1,40,20,15,1]
["HVAC53","PTHP","Packaged Terminal HP - PTHP",14000,14999,"N/A","N/A","Calc","N/A","Calc","N/A","N/A","N/A","N/A",9.9,9.9,"N/A","N/A",3,3,40,20,15,1]
["HVAC54","PTHP","Packaged Terminal HP - PTHP",15000,999999999,"N/A","N/A","Calc","N/A","Calc","N/A","N/A","N/A","N/A",9.6,9.6,"N/A","N/A",3,3,40,20,15,1]
["HVAC55","PVAC","Single Packaged Vertical AC - PVAC",1,64999,"N/A","N/A",10,"N/A","N/A","N/A","N/A","N/A","N/A",10.199999999999999,10.199999999999999,"N/A","N/A","N/A","N/A",45,10,15,1]
["HVAC56","PVAC","Single Packaged Vertical AC - PVAC",1,64999,"N/A","N/A",10,"N/A","N/A","N/A","N/A","N/A","N/A",10.7,10.7,"N/A","N/A","N/A","N/A",47,12,15,2]
["HVAC57","PVAC","Single Packaged Vertical AC - PVAC",65000,134999,"N/A","N/A",10,"N/A","N/A","N/A","N/A","N/A","N/A",10.199999999999999,10.199999999999999,"N/A","N/A","N/A","N/A",45,10,15,1]
["HVAC58","PVAC","Single Packaged Vertical AC - PVAC",65000,134999,"N/A","N/A",10,"N/A","N/A","N/A","N/A","N/A","N/A",10.7,10.7,"N/A","N/A","N/A","N/A",47,12,15,2]
["HVAC59","PVAC","Single Packaged Vertical AC - PVAC",135000,239999,"N/A","N/A",10,"N/A","N/A","N/A","N/A","N/A","N/A",10.199999999999999,10.199999999999999,"N/A","N/A","N/A","N/A",45,10,15,1]
["HVAC60","PVAC","Single Packaged Vertical AC - PVAC",135000,239999,"N/A","N/A",10,"N/A","N/A","N/A","N/A","N/A","N/A",10.7,10.7,"N/A","N/A","N/A","N/A",47,12,15,2]
["HVAC61","PVHP","Single Packaged Vertical HP - PVHP",1,64999,"N/A","N/A",10,"N/A",3,"N/A","N/A","N/A","N/A",10.199999999999999,10.199999999999999,"N/A","N/A",3.1,3.1,45,10,15,1]
["HVAC62","PVHP","Single Packaged Vertical HP - PVHP",1,64999,"N/A","N/A",10,"N/A",3,"N/A","N/A","N/A","N/A",10.7,10.7,"N/A","N/A",3.2,3.2,47,12,15,2]
["HVAC63","PVHP","Single Packaged Vertical HP - PVHP",65000,134999,"N/A","N/A",10,"N/A",3,"N/A","N/A","N/A","N/A",10.199999999999999,10.199999999999999,"N/A","N/A",3.1,3.1,45,10,15,1]
["HVAC64","PVHP","Single Packaged Vertical HP - PVHP",65000,134999,"N/A","N/A",10,"N/A",3,"N/A","N/A","N/A","N/A",10.7,10.7,"N/A","N/A",3.2,3.2,47,12,15,2]
["HVAC65","PVHP","Single Packaged Vertical HP - PVHP",135000,239999,"N/A","N/A",10,"N/A",3,"N/A","N/A","N/A","N/A",10.199999999999999,10.199999999999999,"N/A","N/A",3.1,3.1,45,10,15,1]
["HVAC66","PVHP","Single Packaged Vertical HP - PVHP",135000,239999,"N/A","N/A",10,"N/A",3,"N/A","N/A","N/A","N/A",10.7,10.7,"N/A","N/A",3.2,3.2,47,12,15,2]
["HVAC67","O","Occupancy Controlled Thermostats",0,999999999,"N/A","N/A","N/A","N/A","N/A","N/A","N/A","N/A","N/A","N/A","N/A","N/A","N/A","N/A","N/A",75,75,11,"N/A"]
["HVAC68","E","A/C Economizing Controls",1,60000,"N/A","N/A","N/A","N/A","N/A","N/A","N/A","N/A","N/A","N/A","N/A","N/A","N/A","N/A","N/A",85,85,15,"N/A"]
["HVAC69","E","A/C Economizing Controls",60001,999999999,"N/A","N/A","N/A","N/A","N/A","N/A","N/A","N/A","N/A","N/A","N/A","N/A","N/A","N/A","N/A",170,170,15,"N/A"]

{"sheet":"Table","index":2,"n_rows":29,"n_cols":3,"rows_kept":29,"cut":false,"hidden":true,"merged":[]}
["Facility Type","Heating EFLHh","Cooling EFLHc"]
["Assembly",603,669]
["Auto repair",1910,426]
["Dormitory",465,800]
["Hospital",3366,1424]
["Light industrial",714,549]
["Lodging – Hotel",1077,2918]
["Lodging – Motel",619,1233]
["Office – large",2034,720]
["Office – small",431,955]
["Other",681,736]
["Religious worship",722,279]
["Restaurant – fast food",813,645]
["Restaurant – full service",821,574]
["Retail – big box",191,1279]
["Retail – Grocery",191,1279]
["Retail – small",545,882]
["Retail – large",2101,1068]
["School – Community college",1431,846]
["School – postsecondary",1191,1208]
["School – primary",840,394]
["School – secondary",901,466]
["Warehouse",452,400]
["Multifamily: Low-rise, Prior to 1979",757,507]
["Multifamily: Low-rise, From 1979 to 2006",723,550]
["Multifamily: Low-rise, From 2007 through present",503,562]
["Multifamily: High-rise, Prior to 1979",526,793]
["Multifamily: High-rise, From 1979 to 2006",395,843]
["Multifamily: High-rise, From 2007 through present",219,954]

{"sheet":"Export","index":3,"n_rows":26,"n_cols":25,"rows_kept":26,"cut":false,"hidden":true,"merged":[]}
["Measure Type","Manufacturer","Model","Capacity/Size","Capacity/Size Units","EER Efficiency","SEER Efficiency","Incentive Per Unit","Quantity Committed","Annual Electricity Savings","Peak Demand Reduction","Lifetime Electricity Savings","Annual Gas Savings","Lifetime Gas Savings","Efficiency- other","Efficiency- other-type","Measure ID removed","Quantity Installed","Project in UEZ","Project in OZ","Municipality","K-12 School","County","Affordable Housing","Enhanced Incentive per Unit"]
[{"$f":"IF(Worksheet!R20=0,\"\",IF(OR(Worksheet!C20=\"AS\",Worksheet!C20=\"AP\")=TRUE,74,IF(Worksheet!C20=\"E\",340,IF(Worksheet!C20=\"D\",77,IF(OR(Worksheet!C20=\"PTAC\",Worksheet!C20=\"PTHP\")=TRUE,75,IF(Worksheet!C20=\"W\",78,IF(Worksheet!C20=\"O\",222,73)))))))","v":""},{"$f":"IF(ISBLANK(Worksheet!D20)=FALSE,Worksheet!D20,\"\")","v":""},{"$f":"IF(ISBLANK(Worksheet!E20)=FALSE,Worksheet!E20,\"\")","v":""},{"$f":"Worksheet!K20","v":0},"Btuh",{"$f":"IF(Worksheet!K20>=65000,Worksheet!L20,\"\")","v":""},{"$f":"IF(Worksheet!K20<65000,Worksheet!L20,\"\")","v":0},{"$f":"Worksheet!R20","v":0},{"$f":"IF(ISBLANK(Worksheet!P20)=FALSE,Worksheet!P20,\"\")","v":""},{"$f":"Worksheet!AB20","v":0},{"$f":"Worksheet!Y20","v":0},{"$f":"IFERROR(Worksheet!AJ20/I2,\"\")","v":""},{"$f":"IF(ISBLANK($I2),\"\",IFERROR(Worksheet!AH20/$I2,\"\"))","v":""},{"$f":"IF(ISBLANK($I2),\"\",IFERROR(Worksheet!AL20/$I2,\"\"))","v":""},null,null,null,{"$f":"IF(ISBLANK(Worksheet!Q20)=FALSE,Worksheet!Q20,\"\")","v":""},{"$f":"IF(Worksheet!$A$10=TRUE,\"Y\",\"N\")","v":"N"},{"$f":"IF(Worksheet!$A$11=TRUE,\"Y\",\"N\")","v":"N"},{"$f":"IF(Worksheet!$C$10=TRUE,\"Y\",\"N\")","v":"N"},{"$f":"IF(Worksheet!$C$11=TRUE,\"Y\",\"N\")","v":"N"},{"$f":"IF(Worksheet!$D$10=TRUE,\"Y\",\"N\")","v":"N"},{"$f":"IF(Worksheet!$D$11=TRUE,\"Y\",\"N\")","v":"N"},{"$f":"IFERROR(Worksheet!S20,\"\")","v":0}]
[{"$f":"IF(Worksheet!R21=0,\"\",IF(OR(Worksheet!C21=\"AS\",Worksheet!C21=\"AP\")=TRUE,74,IF(Worksheet!C21=\"E\",340,IF(Worksheet!C21=\"D\",77,IF(OR(Worksheet!C21=\"PTAC\",Worksheet!C21=\"PTHP\")=TRUE,75,IF(Worksheet!C21=\"W\",78,IF(Worksheet!C21=\"O\",222,73)))))))","v":""},{"$f":"IF(ISBLANK(Worksheet!D21)=FALSE,Worksheet!D21,\"\")","v":""},{"$f":"IF(ISBLANK(Worksheet!E21)=FALSE,Worksheet!E21,\"\")","v":""},{"$f":"Worksheet!K21","v":0},"Btuh",{"$f":"IF(Worksheet!K21>=65000,Worksheet!L21,\"\")","v":""},{"$f":"IF(Worksheet!K21<65000,Worksheet!L21,\"\")","v":0},{"$f":"Worksheet!R21","v":0},{"$f":"IF(ISBLANK(Worksheet!P21)=FALSE,Worksheet!P21,\"\")","v":""},{"$f":"Worksheet!AB21","v":0},{"$f":"Worksheet!Y21","v":0},{"$f":"IFERROR(Worksheet!AJ21/I3,\"\")","v":""},{"$f":"IF(ISBLANK($I3),\"\",IFERROR(Worksheet!AH21/$I3,\"\"))","v":""},{"$f":"IF(ISBLANK($I3),\"\",IFERROR(Worksheet!AL21/$I3,\"\"))","v":""},null,null,null,{"$f":"IF(ISBLANK(Worksheet!Q21)=FALSE,Worksheet!Q21,\"\")","v":""},{"$f":"IF(Worksheet!$A$10=TRUE,\"Y\",\"N\")","v":"N"},{"$f":"IF(Worksheet!$A$11=TRUE,\"Y\",\"N\")","v":"N"},{"$f":"IF(Worksheet!$C$10=TRUE,\"Y\",\"N\")","v":"N"},{"$f":"IF(Worksheet!$C$11=TRUE,\"Y\",\"N\")","v":"N"},{"$f":"IF(Worksheet!$D$10=TRUE,\"Y\",\"N\")","v":"N"},{"$f":"IF(Worksheet!$D$11=TRUE,\"Y\",\"N\")","v":"N"},{"$f":"IFERROR(Worksheet!S21,\"\")","v":0}]
[{"$f":"IF(Worksheet!R22=0,\"\",IF(OR(Worksheet!C22=\"AS\",Worksheet!C22=\"AP\")=TRUE,74,IF(Worksheet!C22=\"E\",340,IF(Worksheet!C22=\"D\",77,IF(OR(Worksheet!C22=\"PTAC\",Worksheet!C22=\"PTHP\")=TRUE,75,IF(Worksheet!C22=\"W\",78,IF(Worksheet!C22=\"O\",222,73)))))))","v":""},{"$f":"IF(ISBLANK(Worksheet!D22)=FALSE,Worksheet!D22,\"\")","v":""},{"$f":"IF(ISBLANK(Worksheet!E22)=FALSE,Worksheet!E22,\"\")","v":""},{"$f":"Worksheet!K22","v":0},"Btuh",{"$f":"IF(Worksheet!K22>=65000,Worksheet!L22,\"\")","v":""},{"$f":"IF(Worksheet!K22<65000,Worksheet!L22,\"\")","v":0},{"$f":"Worksheet!R22","v":0},{"$f":"IF(ISBLANK(Worksheet!P22)=FALSE,Worksheet!P22,\"\")","v":""},{"$f":"Worksheet!AB22","v":0},{"$f":"Worksheet!Y22","v":0},{"$f":"IFERROR(Worksheet!AJ22/I4,\"\")","v":""},{"$f":"IF(ISBLANK($I4),\"\",IFERROR(Worksheet!AH22/$I4,\"\"))","v":""},{"$f":"IF(ISBLANK($I4),\"\",IFERROR(Worksheet!AL22/$I4,\"\"))","v":""},null,null,null,{"$f":"IF(ISBLANK(Worksheet!Q22)=FALSE,Worksheet!Q22,\"\")","v":""},{"$f":"IF(Worksheet!$A$10=TRUE,\"Y\",\"N\")","v":"N"},{"$f":"IF(Worksheet!$A$11=TRUE,\"Y\",\"N\")","v":"N"},{"$f":"IF(Worksheet!$C$10=TRUE,\"Y\",\"N\")","v":"N"},{"$f":"IF(Worksheet!$C$11=TRUE,\"Y\",\"N\")","v":"N"},{"$f":"IF(Worksheet!$D$10=TRUE,\"Y\",\"N\")","v":"N"},{"$f":"IF(Worksheet!$D$11=TRUE,\"Y\",\"N\")","v":"N"},{"$f":"IFERROR(Worksheet!S22,\"\")","v":0}]
[{"$f":"IF(Worksheet!R23=0,\"\",IF(OR(Worksheet!C23=\"AS\",Worksheet!C23=\"AP\")=TRUE,74,IF(Worksheet!C23=\"E\",340,IF(Worksheet!C23=\"D\",77,IF(OR(Worksheet!C23=\"PTAC\",Worksheet!C23=\"PTHP\")=TRUE,75,IF(Worksheet!C23=\"W\",78,IF(Worksheet!C23=\"O\",222,73)))))))","v":""},{"$f":"IF(ISBLANK(Worksheet!D23)=FALSE,Worksheet!D23,\"\")","v":""},{"$f":"IF(ISBLANK(Worksheet!E23)=FALSE,Worksheet!E23,\"\")","v":""},{"$f":"Worksheet!K23","v":0},"Btuh",{"$f":"IF(Worksheet!K23>=65000,Worksheet!L23,\"\")","v":""},{"$f":"IF(Worksheet!K23<65000,Worksheet!L23,\"\")","v":0},{"$f":"Worksheet!R23","v":0},{"$f":"IF(ISBLANK(Worksheet!P23)=FALSE,Worksheet!P23,\"\")","v":""},{"$f":"Worksheet!AB23","v":0},{"$f":"Worksheet!Y23","v":0},{"$f":"IFERROR(Worksheet!AJ23/I5,\"\")","v":""},{"$f":"IF(ISBLANK($I5),\"\",IFERROR(Worksheet!AH23/$I5,\"\"))","v":""},{"$f":"IF(ISBLANK($I5),\"\",IFERROR(Worksheet!AL23/$I5,\"\"))","v":""},null,null,null,{"$f":"IF(ISBLANK(Worksheet!Q23)=FALSE,Worksheet!Q23,\"\")","v":""},{"$f":"IF(Worksheet!$A$10=TRUE,\"Y\",\"N\")","v":"N"},{"$f":"IF(Worksheet!$A$11=TRUE,\"Y\",\"N\")","v":"N"},{"$f":"IF(Worksheet!$C$10=TRUE,\"Y\",\"N\")","v":"N"},{"$f":"IF(Worksheet!$C$11=TRUE,\"Y\",\"N\")","v":"N"},{"$f":"IF(Worksheet!$D$10=TRUE,\"Y\",\"N\")","v":"N"},{"$f":"IF(Worksheet!$D$11=TRUE,\"Y\",\"N\")","v":"N"},{"$f":"IFERROR(Worksheet!S23,\"\")","v":0}]
[{"$f":"IF(Worksheet!R24=0,\"\",IF(OR(Worksheet!C24=\"AS\",Worksheet!C24=\"AP\")=TRUE,74,IF(Worksheet!C24=\"E\",340,IF(Worksheet!C24=\"D\",77,IF(OR(Worksheet!C24=\"PTAC\",Worksheet!C24=\"PTHP\")=TRUE,75,IF(Worksheet!C24=\"W\",78,IF(Worksheet!C24=\"O\",222,73)))))))","v":""},{"$f":"IF(ISBLANK(Worksheet!D24)=FALSE,Worksheet!D24,\"\")","v":""},{"$f":"IF(ISBLANK(Worksheet!E24)=FALSE,Worksheet!E24,\"\")","v":""},{"$f":"Worksheet!K24","v":0},"Btuh",{"$f":"IF(Worksheet!K24>=65000,Worksheet!L24,\"\")","v":""},{"$f":"IF(Worksheet!K24<65000,Worksheet!L24,\"\")","v":0},{"$f":"Worksheet!R24","v":0},{"$f":"IF(ISBLANK(Worksheet!P24)=FALSE,Worksheet!P24,\"\")","v":""},{"$f":"Worksheet!AB24","v":0},{"$f":"Worksheet!Y24","v":0},{"$f":"IFERROR(Worksheet!AJ24/I6,\"\")","v":""},{"$f":"IF(ISBLANK($I6),\"\",IFERROR(Worksheet!AH24/$I6,\"\"))","v":""},{"$f":"IF(ISBLANK($I6),\"\",IFERROR(Worksheet!AL24/$I6,\"\"))","v":""},null,null,null,{"$f":"IF(ISBLANK(Worksheet!Q24)=FALSE,Worksheet!Q24,\"\")","v":""},{"$f":"IF(Worksheet!$A$10=TRUE,\"Y\",\"N\")","v":"N"},{"$f":"IF(Worksheet!$A$11=TRUE,\"Y\",\"N\")","v":"N"},{"$f":"IF(Worksheet!$C$10=TRUE,\"Y\",\"N\")","v":"N"},{"$f":"IF(Worksheet!$C$11=TRUE,\"Y\",\"N\")","v":"N"},{"$f":"IF(Worksheet!$D$10=TRUE,\"Y\",\"N\")","v":"N"},{"$f":"IF(Worksheet!$D$11=TRUE,\"Y\",\"N\")","v":"N"},{"$f":"IFERROR(Worksheet!S24,\"\")","v":0}]
[{"$f":"IF(Worksheet!R25=0,\"\",IF(OR(Worksheet!C25=\"AS\",Worksheet!C25=\"AP\")=TRUE,74,IF(Worksheet!C25=\"E\",340,IF(Worksheet!C25=\"D\",77,IF(OR(Worksheet!C25=\"PTAC\",Worksheet!C25=\"PTHP\")=TRUE,75,IF(Worksheet!C25=\"W\",78,IF(Worksheet!C25=\"O\",222,73)))))))","v":""},{"$f":"IF(ISBLANK(Worksheet!D25)=FALSE,Worksheet!D25,\"\")","v":""},{"$f":"IF(ISBLANK(Worksheet!E25)=FALSE,Worksheet!E25,\"\")","v":""},{"$f":"Worksheet!K25","v":0},"Btuh",{"$f":"IF(Worksheet!K25>=65000,Worksheet!L25,\"\")","v":""},{"$f":"IF(Worksheet!K25<65000,Worksheet!L25,\"\")","v":0},{"$f":"Worksheet!R25","v":0},{"$f":"IF(ISBLANK(Worksheet!P25)=FALSE,Worksheet!P25,\"\")","v":""},{"$f":"Worksheet!AB25","v":0},{"$f":"Worksheet!Y25","v":0},{"$f":"IFERROR(Worksheet!AJ25/I7,\"\")","v":""},{"$f":"IF(ISBLANK($I7),\"\",IFERROR(Worksheet!AH25/$I7,\"\"))","v":""},{"$f":"IF(ISBLANK($I7),\"\",IFERROR(Worksheet!AL25/$I7,\"\"))","v":""},null,null,null,{"$f":"IF(ISBLANK(Worksheet!Q25)=FALSE,Worksheet!Q25,\"\")","v":""},{"$f":"IF(Worksheet!$A$10=TRUE,\"Y\",\"N\")","v":"N"},{"$f":"IF(Worksheet!$A$11=TRUE,\"Y\",\"N\")","v":"N"},{"$f":"IF(Worksheet!$C$10=TRUE,\"Y\",\"N\")","v":"N"},{"$f":"IF(Worksheet!$C$11=TRUE,\"Y\",\"N\")","v":"N"},{"$f":"IF(Worksheet!$D$10=TRUE,\"Y\",\"N\")","v":"N"},{"$f":"IF(Worksheet!$D$11=TRUE,\"Y\",\"N\")","v":"N"},{"$f":"IFERROR(Worksheet!S25,\"\")","v":0}]
[{"$f":"IF(Worksheet!R26=0,\"\",IF(OR(Worksheet!C26=\"AS\",Worksheet!C26=\"AP\")=TRUE,74,IF(Worksheet!C26=\"E\",340,IF(Worksheet!C26=\"D\",77,IF(OR(Worksheet!C26=\"PTAC\",Worksheet!C26=\"PTHP\")=TRUE,75,IF(Worksheet!C26=\"W\",78,IF(Worksheet!C26=\"O\",222,73)))))))","v":""},{"$f":"IF(ISBLANK(Worksheet!D26)=FALSE,Worksheet!D26,\"\")","v":""},{"$f":"IF(ISBLANK(Worksheet!E26)=FALSE,Worksheet!E26,\"\")","v":""},{"$f":"Worksheet!K26","v":0},"Btuh",{"$f":"IF(Worksheet!K26>=65000,Worksheet!L26,\"\")","v":""},{"$f":"IF(Worksheet!K26<65000,Worksheet!L26,\"\")","v":0},{"$f":"Worksheet!R26","v":0},{"$f":"IF(ISBLANK(Worksheet!P26)=FALSE,Worksheet!P26,\"\")","v":""},{"$f":"Worksheet!AB26","v":0},{"$f":"Worksheet!Y26","v":0},{"$f":"IFERROR(Worksheet!AJ26/I8,\"\")","v":""},{"$f":"IF(ISBLANK($I8),\"\",IFERROR(Worksheet!AH26/$I8,\"\"))","v":""},{"$f":"IF(ISBLANK($I8),\"\",IFERROR(Worksheet!AL26/$I8,\"\"))","v":""},null,null,null,{"$f":"IF(ISBLANK(Worksheet!Q26)=FALSE,Worksheet!Q26,\"\")","v":""},{"$f":"IF(Worksheet!$A$10=TRUE,\"Y\",\"N\")","v":"N"},{"$f":"IF(Worksheet!$A$11=TRUE,\"Y\",\"N\")","v":"N"},{"$f":"IF(Worksheet!$C$10=TRUE,\"Y\",\"N\")","v":"N"},{"$f":"IF(Worksheet!$C$11=TRUE,\"Y\",\"N\")","v":"N"},{"$f":"IF(Worksheet!$D$10=TRUE,\"Y\",\"N\")","v":"N"},{"$f":"IF(Worksheet!$D$11=TRUE,\"Y\",\"N\")","v":"N"},{"$f":"IFERROR(Worksheet!S26,\"\")","v":0}]
[{"$f":"IF(Worksheet!R27=0,\"\",IF(OR(Worksheet!C27=\"AS\",Worksheet!C27=\"AP\")=TRUE,74,IF(Worksheet!C27=\"E\",340,IF(Worksheet!C27=\"D\",77,IF(OR(Worksheet!C27=\"PTAC\",Worksheet!C27=\"PTHP\")=TRUE,75,IF(Worksheet!C27=\"W\",78,IF(Worksheet!C27=\"O\",222,73)))))))","v":""},{"$f":"IF(ISBLANK(Worksheet!D27)=FALSE,Worksheet!D27,\"\")","v":""},{"$f":"IF(ISBLANK(Worksheet!E27)=FALSE,Worksheet!E27,\"\")","v":""},{"$f":"Worksheet!K27","v":0},"Btuh",{"$f":"IF(Worksheet!K27>=65000,Worksheet!L27,\"\")","v":""},{"$f":"IF(Worksheet!K27<65000,Worksheet!L27,\"\")","v":0},{"$f":"Worksheet!R27","v":0},{"$f":"IF(ISBLANK(Worksheet!P27)=FALSE,Worksheet!P27,\"\")","v":""},{"$f":"Worksheet!AB27","v":0},{"$f":"Worksheet!Y27","v":0},{"$f":"IFERROR(Worksheet!AJ27/I9,\"\")","v":""},{"$f":"IF(ISBLANK($I9),\"\",IFERROR(Worksheet!AH27/$I9,\"\"))","v":""},{"$f":"IF(ISBLANK($I9),\"\",IFERROR(Worksheet!AL27/$I9,\"\"))","v":""},null,null,null,{"$f":"IF(ISBLANK(Worksheet!Q27)=FALSE,Worksheet!Q27,\"\")","v":""},{"$f":"IF(Worksheet!$A$10=TRUE,\"Y\",\"N\")","v":"N"},{"$f":"IF(Worksheet!$A$11=TRUE,\"Y\",\"N\")","v":"N"},{"$f":"IF(Worksheet!$C$10=TRUE,\"Y\",\"N\")","v":"N"},{"$f":"IF(Worksheet!$C$11=TRUE,\"Y\",\"N\")","v":"N"},{"$f":"IF(Worksheet!$D$10=TRUE,\"Y\",\"N\")","v":"N"},{"$f":"IF(Worksheet!$D$11=TRUE,\"Y\",\"N\")","v":"N"},{"$f":"IFERROR(Worksheet!S27,\"\")","v":0}]
[{"$f":"IF(Worksheet!R28=0,\"\",IF(OR(Worksheet!C28=\"AS\",Worksheet!C28=\"AP\")=TRUE,74,IF(Worksheet!C28=\"E\",340,IF(Worksheet!C28=\"D\",77,IF(OR(Worksheet!C28=\"PTAC\",Worksheet!C28=\"PTHP\")=TRUE,75,IF(Worksheet!C28=\"W\",78,IF(Worksheet!C28=\"O\",222,73)))))))","v":""},{"$f":"IF(ISBLANK(Worksheet!D28)=FALSE,Worksheet!D28,\"\")","v":""},{"$f":"IF(ISBLANK(Worksheet!E28)=FALSE,Worksheet!E28,\"\")","v":""},{"$f":"Worksheet!K28","v":0},"Btuh",{"$f":"IF(Worksheet!K28>=65000,Worksheet!L28,\"\")","v":""},{"$f":"IF(Worksheet!K28<65000,Worksheet!L28,\"\")","v":0},{"$f":"Worksheet!R28","v":0},{"$f":"IF(ISBLANK(Worksheet!P28)=FALSE,Worksheet!P28,\"\")","v":""},{"$f":"Worksheet!AB28","v":0},{"$f":"Worksheet!Y28","v":0},{"$f":"IFERROR(Worksheet!AJ28/I10,\"\")","v":""},{"$f":"IF(ISBLANK($I10),\"\",IFERROR(Worksheet!AH28/$I10,\"\"))","v":""},{"$f":"IF(ISBLANK($I10),\"\",IFERROR(Worksheet!AL28/$I10,\"\"))","v":""},null,null,null,{"$f":"IF(ISBLANK(Worksheet!Q28)=FALSE,Worksheet!Q28,\"\")","v":""},{"$f":"IF(Worksheet!$A$10=TRUE,\"Y\",\"N\")","v":"N"},{"$f":"IF(Worksheet!$A$11=TRUE,\"Y\",\"N\")","v":"N"},{"$f":"IF(Worksheet!$C$10=TRUE,\"Y\",\"N\")","v":"N"},{"$f":"IF(Worksheet!$C$11=TRUE,\"Y\",\"N\")","v":"N"},{"$f":"IF(Worksheet!$D$10=TRUE,\"Y\",\"N\")","v":"N"},{"$f":"IF(Worksheet!$D$11=TRUE,\"Y\",\"N\")","v":"N"},{"$f":"IFERROR(Worksheet!S28,\"\")","v":0}]
[{"$f":"IF(Worksheet!R29=0,\"\",IF(OR(Worksheet!C29=\"AS\",Worksheet!C29=\"AP\")=TRUE,74,IF(Worksheet!C29=\"E\",340,IF(Worksheet!C29=\"D\",77,IF(OR(Worksheet!C29=\"PTAC\",Worksheet!C29=\"PTHP\")=TRUE,75,IF(Worksheet!C29=\"W\",78,IF(Worksheet!C29=\"O\",222,73)))))))","v":""},{"$f":"IF(ISBLANK(Worksheet!D29)=FALSE,Worksheet!D29,\"\")","v":""},{"$f":"IF(ISBLANK(Worksheet!E29)=FALSE,Worksheet!E29,\"\")","v":""},{"$f":"Worksheet!K29","v":0},"Btuh",{"$f":"IF(Worksheet!K29>=65000,Worksheet!L29,\"\")","v":""},{"$f":"IF(Worksheet!K29<65000,Worksheet!L29,\"\")","v":0},{"$f":"Worksheet!R29","v":0},{"$f":"IF(ISBLANK(Worksheet!P29)=FALSE,Worksheet!P29,\"\")","v":""},{"$f":"Worksheet!AB29","v":0},{"$f":"Worksheet!Y29","v":0},{"$f":"IFERROR(Worksheet!AJ29/I11,\"\")","v":""},{"$f":"IF(ISBLANK($I11),\"\",IFERROR(Worksheet!AH29/$I11,\"\"))","v":""},{"$f":"IF(ISBLANK($I11),\"\",IFERROR(Worksheet!AL29/$I11,\"\"))","v":""},null,null,null,{"$f":"IF(ISBLANK(Worksheet!Q29)=FALSE,Worksheet!Q29,\"\")","v":""},{"$f":"IF(Worksheet!$A$10=TRUE,\"Y\",\"N\")","v":"N"},{"$f":"IF(Worksheet!$A$11=TRUE,\"Y\",\"N\")","v":"N"},{"$f":"IF(Worksheet!$C$10=TRUE,\"Y\",\"N\")","v":"N"},{"$f":"IF(Worksheet!$C$11=TRUE,\"Y\",\"N\")","v":"N"},{"$f":"IF(Worksheet!$D$10=TRUE,\"Y\",\"N\")","v":"N"},{"$f":"IF(Worksheet!$D$11=TRUE,\"Y\",\"N\")","v":"N"},{"$f":"IFERROR(Worksheet!S29,\"\")","v":0}]
[{"$f":"IF(Worksheet!R30=0,\"\",IF(OR(Worksheet!C30=\"AS\",Worksheet!C30=\"AP\")=TRUE,74,IF(Worksheet!C30=\"E\",340,IF(Worksheet!C30=\"D\",77,IF(OR(Worksheet!C30=\"PTAC\",Worksheet!C30=\"PTHP\")=TRUE,75,IF(Worksheet!C30=\"W\",78,IF(Worksheet!C30=\"O\",222,73)))))))","v":""},{"$f":"IF(ISBLANK(Worksheet!D30)=FALSE,Worksheet!D30,\"\")","v":""},{"$f":"IF(ISBLANK(Worksheet!E30)=FALSE,Worksheet!E30,\"\")","v":""},{"$f":"Worksheet!K30","v":0},"Btuh",{"$f":"IF(Worksheet!K30>=65000,Worksheet!L30,\"\")","v":""},{"$f":"IF(Worksheet!K30<65000,Worksheet!L30,\"\")","v":0},{"$f":"Worksheet!R30","v":0},{"$f":"IF(ISBLANK(Worksheet!P30)=FALSE,Worksheet!P30,\"\")","v":""},{"$f":"Worksheet!AB30","v":0},{"$f":"Worksheet!Y30","v":0},{"$f":"IFERROR(Worksheet!AJ30/I12,\"\")","v":""},{"$f":"IF(ISBLANK($I12),\"\",IFERROR(Worksheet!AH30/$I12,\"\"))","v":""},{"$f":"IF(ISBLANK($I12),\"\",IFERROR(Worksheet!AL30/$I12,\"\"))","v":""},null,null,null,{"$f":"IF(ISBLANK(Worksheet!Q30)=FALSE,Worksheet!Q30,\"\")","v":""},{"$f":"IF(Worksheet!$A$10=TRUE,\"Y\",\"N\")","v":"N"},{"$f":"IF(Worksheet!$A$11=TRUE,\"Y\",\"N\")","v":"N"},{"$f":"IF(Worksheet!$C$10=TRUE,\"Y\",\"N\")","v":"N"},{"$f":"IF(Worksheet!$C$11=TRUE,\"Y\",\"N\")","v":"N"},{"$f":"IF(Worksheet!$D$10=TRUE,\"Y\",\"N\")","v":"N"},{"$f":"IF(Worksheet!$D$11=TRUE,\"Y\",\"N\")","v":"N"},{"$f":"IFERROR(Worksheet!S30,\"\")","v":0}]
[{"$f":"IF(Worksheet!R31=0,\"\",IF(OR(Worksheet!C31=\"AS\",Worksheet!C31=\"AP\")=TRUE,74,IF(Worksheet!C31=\"E\",340,IF(Worksheet!C31=\"D\",77,IF(OR(Worksheet!C31=\"PTAC\",Worksheet!C31=\"PTHP\")=TRUE,75,IF(Worksheet!C31=\"W\",78,IF(Worksheet!C31=\"O\",222,73)))))))","v":""},{"$f":"IF(ISBLANK(Worksheet!D31)=FALSE,Worksheet!D31,\"\")","v":""},{"$f":"IF(ISBLANK(Worksheet!E31)=FALSE,Worksheet!E31,\"\")","v":""},{"$f":"Worksheet!K31","v":0},"Btuh",{"$f":"IF(Worksheet!K31>=65000,Worksheet!L31,\"\")","v":""},{"$f":"IF(Worksheet!K31<65000,Worksheet!L31,\"\")","v":0},{"$f":"Worksheet!R31","v":0},{"$f":"IF(ISBLANK(Worksheet!P31)=FALSE,Worksheet!P31,\"\")","v":""},{"$f":"Worksheet!AB31","v":0},{"$f":"Worksheet!Y31","v":0},{"$f":"IFERROR(Worksheet!AJ31/I13,\"\")","v":""},{"$f":"IF(ISBLANK($I13),\"\",IFERROR(Worksheet!AH31/$I13,\"\"))","v":""},{"$f":"IF(ISBLANK($I13),\"\",IFERROR(Worksheet!AL31/$I13,\"\"))","v":""},null,null,null,{"$f":"IF(ISBLANK(Worksheet!Q31)=FALSE,Worksheet!Q31,\"\")","v":""},{"$f":"IF(Worksheet!$A$10=TRUE,\"Y\",\"N\")","v":"N"},{"$f":"IF(Worksheet!$A$11=TRUE,\"Y\",\"N\")","v":"N"},{"$f":"IF(Worksheet!$C$10=TRUE,\"Y\",\"N\")","v":"N"},{"$f":"IF(Worksheet!$C$11=TRUE,\"Y\",\"N\")","v":"N"},{"$f":"IF(Worksheet!$D$10=TRUE,\"Y\",\"N\")","v":"N"},{"$f":"IF(Worksheet!$D$11=TRUE,\"Y\",\"N\")","v":"N"},{"$f":"IFERROR(Worksheet!S31,\"\")","v":0}]
[{"$f":"IF(Worksheet!R32=0,\"\",IF(OR(Worksheet!C32=\"AS\",Worksheet!C32=\"AP\")=TRUE,74,IF(Worksheet!C32=\"E\",340,IF(Worksheet!C32=\"D\",77,IF(OR(Worksheet!C32=\"PTAC\",Worksheet!C32=\"PTHP\")=TRUE,75,IF(Worksheet!C32=\"W\",78,IF(Worksheet!C32=\"O\",222,73)))))))","v":""},{"$f":"IF(ISBLANK(Worksheet!D32)=FALSE,Worksheet!D32,\"\")","v":""},{"$f":"IF(ISBLANK(Worksheet!E32)=FALSE,Worksheet!E32,\"\")","v":""},{"$f":"Worksheet!K32","v":0},"Btuh",{"$f":"IF(Worksheet!K32>=65000,Worksheet!L32,\"\")","v":""},{"$f":"IF(Worksheet!K32<65000,Worksheet!L32,\"\")","v":0},{"$f":"Worksheet!R32","v":0},{"$f":"IF(ISBLANK(Worksheet!P32)=FALSE,Worksheet!P32,\"\")","v":""},{"$f":"Worksheet!AB32","v":0},{"$f":"Worksheet!Y32","v":0},{"$f":"IFERROR(Worksheet!AJ32/I14,\"\")","v":""},{"$f":"IF(ISBLANK($I14),\"\",IFERROR(Worksheet!AH32/$I14,\"\"))","v":""},{"$f":"IF(ISBLANK($I14),\"\",IFERROR(Worksheet!AL32/$I14,\"\"))","v":""},null,null,null,{"$f":"IF(ISBLANK(Worksheet!Q32)=FALSE,Worksheet!Q32,\"\")","v":""},{"$f":"IF(Worksheet!$A$10=TRUE,\"Y\",\"N\")","v":"N"},{"$f":"IF(Worksheet!$A$11=TRUE,\"Y\",\"N\")","v":"N"},{"$f":"IF(Worksheet!$C$10=TRUE,\"Y\",\"N\")","v":"N"},{"$f":"IF(Worksheet!$C$11=TRUE,\"Y\",\"N\")","v":"N"},{"$f":"IF(Worksheet!$D$10=TRUE,\"Y\",\"N\")","v":"N"},{"$f":"IF(Worksheet!$D$11=TRUE,\"Y\",\"N\")","v":"N"},{"$f":"IFERROR(Worksheet!S32,\"\")","v":0}]
[{"$f":"IF(Worksheet!R33=0,\"\",IF(OR(Worksheet!C33=\"AS\",Worksheet!C33=\"AP\")=TRUE,74,IF(Worksheet!C33=\"E\",340,IF(Worksheet!C33=\"D\",77,IF(OR(Worksheet!C33=\"PTAC\",Worksheet!C33=\"PTHP\")=TRUE,75,IF(Worksheet!C33=\"W\",78,IF(Worksheet!C33=\"O\",222,73)))))))","v":""},{"$f":"IF(ISBLANK(Worksheet!D33)=FALSE,Worksheet!D33,\"\")","v":""},{"$f":"IF(ISBLANK(Worksheet!E33)=FALSE,Worksheet!E33,\"\")","v":""},{"$f":"Worksheet!K33","v":0},"Btuh",{"$f":"IF(Worksheet!K33>=65000,Worksheet!L33,\"\")","v":""},{"$f":"IF(Worksheet!K33<65000,Worksheet!L33,\"\")","v":0},{"$f":"Worksheet!R33","v":0},{"$f":"IF(ISBLANK(Worksheet!P33)=FALSE,Worksheet!P33,\"\")","v":""},{"$f":"Worksheet!AB33","v":0},{"$f":"Worksheet!Y33","v":0},{"$f":"IFERROR(Worksheet!AJ33/I15,\"\")","v":""},{"$f":"IF(ISBLANK($I15),\"\",IFERROR(Worksheet!AH33/$I15,\"\"))","v":""},{"$f":"IF(ISBLANK($I15),\"\",IFERROR(Worksheet!AL33/$I15,\"\"))","v":""},null,null,null,{"$f":"IF(ISBLANK(Worksheet!Q33)=FALSE,Worksheet!Q33,\"\")","v":""},{"$f":"IF(Worksheet!$A$10=TRUE,\"Y\",\"N\")","v":"N"},{"$f":"IF(Worksheet!$A$11=TRUE,\"Y\",\"N\")","v":"N"},{"$f":"IF(Worksheet!$C$10=TRUE,\"Y\",\"N\")","v":"N"},{"$f":"IF(Worksheet!$C$11=TRUE,\"Y\",\"N\")","v":"N"},{"$f":"IF(Worksheet!$D$10=TRUE,\"Y\",\"N\")","v":"N"},{"$f":"IF(Worksheet!$D$11=TRUE,\"Y\",\"N\")","v":"N"},{"$f":"IFERROR(Worksheet!S33,\"\")","v":0}]
[{"$f":"IF(Worksheet!R34=0,\"\",IF(OR(Worksheet!C34=\"AS\",Worksheet!C34=\"AP\")=TRUE,74,IF(Worksheet!C34=\"E\",340,IF(Worksheet!C34=\"D\",77,IF(OR(Worksheet!C34=\"PTAC\",Worksheet!C34=\"PTHP\")=TRUE,75,IF(Worksheet!C34=\"W\",78,IF(Worksheet!C34=\"O\",222,73)))))))","v":""},{"$f":"IF(ISBLANK(Worksheet!D34)=FALSE,Worksheet!D34,\"\")","v":""},{"$f":"IF(ISBLANK(Worksheet!E34)=FALSE,Worksheet!E34,\"\")","v":""},{"$f":"Worksheet!K34","v":0},"Btuh",{"$f":"IF(Worksheet!K34>=65000,Worksheet!L34,\"\")","v":""},{"$f":"IF(Worksheet!K34<65000,Worksheet!L34,\"\")","v":0},{"$f":"Worksheet!R34","v":0},{"$f":"IF(ISBLANK(Worksheet!P34)=FALSE,Worksheet!P34,\"\")","v":""},{"$f":"Worksheet!AB34","v":0},{"$f":"Worksheet!Y34","v":0},{"$f":"IFERROR(Worksheet!AJ34/I16,\"\")","v":""},{"$f":"IF(ISBLANK($I16),\"\",IFERROR(Worksheet!AH34/$I16,\"\"))","v":""},{"$f":"IF(ISBLANK($I16),\"\",IFERROR(Worksheet!AL34/$I16,\"\"))","v":""},null,null,null,{"$f":"IF(ISBLANK(Worksheet!Q34)=FALSE,Worksheet!Q34,\"\")","v":""},{"$f":"IF(Worksheet!$A$10=TRUE,\"Y\",\"N\")","v":"N"},{"$f":"IF(Worksheet!$A$11=TRUE,\"Y\",\"N\")","v":"N"},{"$f":"IF(Worksheet!$C$10=TRUE,\"Y\",\"N\")","v":"N"},{"$f":"IF(Worksheet!$C$11=TRUE,\"Y\",\"N\")","v":"N"},{"$f":"IF(Worksheet!$D$10=TRUE,\"Y\",\"N\")","v":"N"},{"$f":"IF(Worksheet!$D$11=TRUE,\"Y\",\"N\")","v":"N"},{"$f":"IFERROR(Worksheet!S34,\"\")","v":0}]
[{"$f":"IF(Worksheet!R35=0,\"\",IF(OR(Worksheet!C35=\"AS\",Worksheet!C35=\"AP\")=TRUE,74,IF(Worksheet!C35=\"E\",340,IF(Worksheet!C35=\"D\",77,IF(OR(Worksheet!C35=\"PTAC\",Worksheet!C35=\"PTHP\")=TRUE,75,IF(Worksheet!C35=\"W\",78,IF(Worksheet!C35=\"O\",222,73)))))))","v":""},{"$f":"IF(ISBLANK(Worksheet!D35)=FALSE,Worksheet!D35,\"\")","v":""},{"$f":"IF(ISBLANK(Worksheet!E35)=FALSE,Worksheet!E35,\"\")","v":""},{"$f":"Worksheet!K35","v":0},"Btuh",{"$f":"IF(Worksheet!K35>=65000,Worksheet!L35,\"\")","v":""},{"$f":"IF(Worksheet!K35<65000,Worksheet!L35,\"\")","v":0},{"$f":"Worksheet!R35","v":0},{"$f":"IF(ISBLANK(Worksheet!P35)=FALSE,Worksheet!P35,\"\")","v":""},{"$f":"Worksheet!AB35","v":0},{"$f":"Worksheet!Y35","v":0},{"$f":"IFERROR(Worksheet!AJ35/I17,\"\")","v":""},{"$f":"IF(ISBLANK($I17),\"\",IFERROR(Worksheet!AH35/$I17,\"\"))","v":""},{"$f":"IF(ISBLANK($I17),\"\",IFERROR(Worksheet!AL35/$I17,\"\"))","v":""},null,null,null,{"$f":"IF(ISBLANK(Worksheet!Q35)=FALSE,Worksheet!Q35,\"\")","v":""},{"$f":"IF(Worksheet!$A$10=TRUE,\"Y\",\"N\")","v":"N"},{"$f":"IF(Worksheet!$A$11=TRUE,\"Y\",\"N\")","v":"N"},{"$f":"IF(Worksheet!$C$10=TRUE,\"Y\",\"N\")","v":"N"},{"$f":"IF(Worksheet!$C$11=TRUE,\"Y\",\"N\")","v":"N"},{"$f":"IF(Worksheet!$D$10=TRUE,\"Y\",\"N\")","v":"N"},{"$f":"IF(Worksheet!$D$11=TRUE,\"Y\",\"N\")","v":"N"},{"$f":"IFERROR(Worksheet!S35,\"\")","v":0}]
[{"$f":"IF(Worksheet!R36=0,\"\",IF(OR(Worksheet!C36=\"AS\",Worksheet!C36=\"AP\")=TRUE,74,IF(Worksheet!C36=\"E\",340,IF(Worksheet!C36=\"D\",77,IF(OR(Worksheet!C36=\"PTAC\",Worksheet!C36=\"PTHP\")=TRUE,75,IF(Worksheet!C36=\"W\",78,IF(Worksheet!C36=\"O\",222,73)))))))","v":""},{"$f":"IF(ISBLANK(Worksheet!D36)=FALSE,Worksheet!D36,\"\")","v":""},{"$f":"IF(ISBLANK(Worksheet!E36)=FALSE,Worksheet!E36,\"\")","v":""},{"$f":"Worksheet!K36","v":0},"Btuh",{"$f":"IF(Worksheet!K36>=65000,Worksheet!L36,\"\")","v":""},{"$f":"IF(Worksheet!K36<65000,Worksheet!L36,\"\")","v":0},{"$f":"Worksheet!R36","v":0},{"$f":"IF(ISBLANK(Worksheet!P36)=FALSE,Worksheet!P36,\"\")","v":""},{"$f":"Worksheet!AB36","v":0},{"$f":"Worksheet!Y36","v":0},{"$f":"IFERROR(Worksheet!AJ36/I18,\"\")","v":""},{"$f":"IF(ISBLANK($I18),\"\",IFERROR(Worksheet!AH36/$I18,\"\"))","v":""},{"$f":"IF(ISBLANK($I18),\"\",IFERROR(Worksheet!AL36/$I18,\"\"))","v":""},null,null,null,{"$f":"IF(ISBLANK(Worksheet!Q36)=FALSE,Worksheet!Q36,\"\")","v":""},{"$f":"IF(Worksheet!$A$10=TRUE,\"Y\",\"N\")","v":"N"},{"$f":"IF(Worksheet!$A$11=TRUE,\"Y\",\"N\")","v":"N"},{"$f":"IF(Worksheet!$C$10=TRUE,\"Y\",\"N\")","v":"N"},{"$f":"IF(Worksheet!$C$11=TRUE,\"Y\",\"N\")","v":"N"},{"$f":"IF(Worksheet!$D$10=TRUE,\"Y\",\"N\")","v":"N"},{"$f":"IF(Worksheet!$D$11=TRUE,\"Y\",\"N\")","v":"N"},{"$f":"IFERROR(Worksheet!S36,\"\")","v":0}]
[{"$f":"IF(Worksheet!R37=0,\"\",IF(OR(Worksheet!C37=\"AS\",Worksheet!C37=\"AP\")=TRUE,74,IF(Worksheet!C37=\"E\",340,IF(Worksheet!C37=\"D\",77,IF(OR(Worksheet!C37=\"PTAC\",Worksheet!C37=\"PTHP\")=TRUE,75,IF(Worksheet!C37=\"W\",78,IF(Worksheet!C37=\"O\",222,73)))))))","v":""},{"$f":"IF(ISBLANK(Worksheet!D37)=FALSE,Worksheet!D37,\"\")","v":""},{"$f":"IF(ISBLANK(Worksheet!E37)=FALSE,Worksheet!E37,\"\")","v":""},{"$f":"Worksheet!K37","v":0},"Btuh",{"$f":"IF(Worksheet!K37>=65000,Worksheet!L37,\"\")","v":""},{"$f":"IF(Worksheet!K37<65000,Worksheet!L37,\"\")","v":0},{"$f":"Worksheet!R37","v":0},{"$f":"IF(ISBLANK(Worksheet!P37)=FALSE,Worksheet!P37,\"\")","v":""},{"$f":"Worksheet!AB37","v":0},{"$f":"Worksheet!Y37","v":0},{"$f":"IFERROR(Worksheet!AJ37/I19,\"\")","v":""},{"$f":"IF(ISBLANK($I19),\"\",IFERROR(Worksheet!AH37/$I19,\"\"))","v":""},{"$f":"IF(ISBLANK($I19),\"\",IFERROR(Worksheet!AL37/$I19,\"\"))","v":""},null,null,null,{"$f":"IF(ISBLANK(Worksheet!Q37)=FALSE,Worksheet!Q37,\"\")","v":""},{"$f":"IF(Worksheet!$A$10=TRUE,\"Y\",\"N\")","v":"N"},{"$f":"IF(Worksheet!$A$11=TRUE,\"Y\",\"N\")","v":"N"},{"$f":"IF(Worksheet!$C$10=TRUE,\"Y\",\"N\")","v":"N"},{"$f":"IF(Worksheet!$C$11=TRUE,\"Y\",\"N\")","v":"N"},{"$f":"IF(Worksheet!$D$10=TRUE,\"Y\",\"N\")","v":"N"},{"$f":"IF(Worksheet!$D$11=TRUE,\"Y\",\"N\")","v":"N"},{"$f":"IFERROR(Worksheet!S37,\"\")","v":0}]
[{"$f":"IF(Worksheet!R38=0,\"\",IF(OR(Worksheet!C38=\"AS\",Worksheet!C38=\"AP\")=TRUE,74,IF(Worksheet!C38=\"E\",340,IF(Worksheet!C38=\"D\",77,IF(OR(Worksheet!C38=\"PTAC\",Worksheet!C38=\"PTHP\")=TRUE,75,IF(Worksheet!C38=\"W\",78,IF(Worksheet!C38=\"O\",222,73)))))))","v":""},{"$f":"IF(ISBLANK(Worksheet!D38)=FALSE,Worksheet!D38,\"\")","v":""},{"$f":"IF(ISBLANK(Worksheet!E38)=FALSE,Worksheet!E38,\"\")","v":""},{"$f":"Worksheet!K38","v":0},"Btuh",{"$f":"IF(Worksheet!K38>=65000,Worksheet!L38,\"\")","v":""},{"$f":"IF(Worksheet!K38<65000,Worksheet!L38,\"\")","v":0},{"$f":"Worksheet!R38","v":0},{"$f":"IF(ISBLANK(Worksheet!P38)=FALSE,Worksheet!P38,\"\")","v":""},{"$f":"Worksheet!AB38","v":0},{"$f":"Worksheet!Y38","v":0},{"$f":"IFERROR(Worksheet!AJ38/I20,\"\")","v":""},{"$f":"IF(ISBLANK($I20),\"\",IFERROR(Worksheet!AH38/$I20,\"\"))","v":""},{"$f":"IF(ISBLANK($I20),\"\",IFERROR(Worksheet!AL38/$I20,\"\"))","v":""},null,null,null,{"$f":"IF(ISBLANK(Worksheet!Q38)=FALSE,Worksheet!Q38,\"\")","v":""},{"$f":"IF(Worksheet!$A$10=TRUE,\"Y\",\"N\")","v":"N"},{"$f":"IF(Worksheet!$A$11=TRUE,\"Y\",\"N\")","v":"N"},{"$f":"IF(Worksheet!$C$10=TRUE,\"Y\",\"N\")","v":"N"},{"$f":"IF(Worksheet!$C$11=TRUE,\"Y\",\"N\")","v":"N"},{"$f":"IF(Worksheet!$D$10=TRUE,\"Y\",\"N\")","v":"N"},{"$f":"IF(Worksheet!$D$11=TRUE,\"Y\",\"N\")","v":"N"},{"$f":"IFERROR(Worksheet!S38,\"\")","v":0}]
[{"$f":"IF(Worksheet!R39=0,\"\",IF(OR(Worksheet!C39=\"AS\",Worksheet!C39=\"AP\")=TRUE,74,IF(Worksheet!C39=\"E\",340,IF(Worksheet!C39=\"D\",77,IF(OR(Worksheet!C39=\"PTAC\",Worksheet!C39=\"PTHP\")=TRUE,75,IF(Worksheet!C39=\"W\",78,IF(Worksheet!C39=\"O\",222,73)))))))","v":""},{"$f":"IF(ISBLANK(Worksheet!D39)=FALSE,Worksheet!D39,\"\")","v":""},{"$f":"IF(ISBLANK(Worksheet!E39)=FALSE,Worksheet!E39,\"\")","v":""},{"$f":"Worksheet!K39","v":0},"Btuh",{"$f":"IF(Worksheet!K39>=65000,Worksheet!L39,\"\")","v":""},{"$f":"IF(Worksheet!K39<65000,Worksheet!L39,\"\")","v":0},{"$f":"Worksheet!R39","v":0},{"$f":"IF(ISBLANK(Worksheet!P39)=FALSE,Worksheet!P39,\"\")","v":""},{"$f":"Worksheet!AB39","v":0},{"$f":"Worksheet!Y39","v":0},{"$f":"IFERROR(Worksheet!AJ39/I21,\"\")","v":""},{"$f":"IF(ISBLANK($I21),\"\",IFERROR(Worksheet!AH39/$I21,\"\"))","v":""},{"$f":"IF(ISBLANK($I21),\"\",IFERROR(Worksheet!AL39/$I21,\"\"))","v":""},null,null,null,{"$f":"IF(ISBLANK(Worksheet!Q39)=FALSE,Worksheet!Q39,\"\")","v":""},{"$f":"IF(Worksheet!$A$10=TRUE,\"Y\",\"N\")","v":"N"},{"$f":"IF(Worksheet!$A$11=TRUE,\"Y\",\"N\")","v":"N"},{"$f":"IF(Worksheet!$C$10=TRUE,\"Y\",\"N\")","v":"N"},{"$f":"IF(Worksheet!$C$11=TRUE,\"Y\",\"N\")","v":"N"},{"$f":"IF(Worksheet!$D$10=TRUE,\"Y\",\"N\")","v":"N"},{"$f":"IF(Worksheet!$D$11=TRUE,\"Y\",\"N\")","v":"N"},{"$f":"IFERROR(Worksheet!S39,\"\")","v":0}]
[{"$f":"IF(Worksheet!R40=0,\"\",IF(OR(Worksheet!C40=\"AS\",Worksheet!C40=\"AP\")=TRUE,74,IF(Worksheet!C40=\"E\",340,IF(Worksheet!C40=\"D\",77,IF(OR(Worksheet!C40=\"PTAC\",Worksheet!C40=\"PTHP\")=TRUE,75,IF(Worksheet!C40=\"W\",78,IF(Worksheet!C40=\"O\",222,73)))))))","v":""},{"$f":"IF(ISBLANK(Worksheet!D40)=FALSE,Worksheet!D40,\"\")","v":""},{"$f":"IF(ISBLANK(Worksheet!E40)=FALSE,Worksheet!E40,\"\")","v":""},{"$f":"Worksheet!K40","v":0},"Btuh",{"$f":"IF(Worksheet!K40>=65000,Worksheet!L40,\"\")","v":""},{"$f":"IF(Worksheet!K40<65000,Worksheet!L40,\"\")","v":0},{"$f":"Worksheet!R40","v":0},{"$f":"IF(ISBLANK(Worksheet!P40)=FALSE,Worksheet!P40,\"\")","v":""},{"$f":"Worksheet!AB40","v":0},{"$f":"Worksheet!Y40","v":0},{"$f":"IFERROR(Worksheet!AJ40/I22,\"\")","v":""},{"$f":"IF(ISBLANK($I22),\"\",IFERROR(Worksheet!AH40/$I22,\"\"))","v":""},{"$f":"IF(ISBLANK($I22),\"\",IFERROR(Worksheet!AL40/$I22,\"\"))","v":""},null,null,null,{"$f":"IF(ISBLANK(Worksheet!Q40)=FALSE,Worksheet!Q40,\"\")","v":""},{"$f":"IF(Worksheet!$A$10=TRUE,\"Y\",\"N\")","v":"N"},{"$f":"IF(Worksheet!$A$11=TRUE,\"Y\",\"N\")","v":"N"},{"$f":"IF(Worksheet!$C$10=TRUE,\"Y\",\"N\")","v":"N"},{"$f":"IF(Worksheet!$C$11=TRUE,\"Y\",\"N\")","v":"N"},{"$f":"IF(Worksheet!$D$10=TRUE,\"Y\",\"N\")","v":"N"},{"$f":"IF(Worksheet!$D$11=TRUE,\"Y\",\"N\")","v":"N"},{"$f":"IFERROR(Worksheet!S40,\"\")","v":0}]
[{"$f":"IF(Worksheet!R41=0,\"\",IF(OR(Worksheet!C41=\"AS\",Worksheet!C41=\"AP\")=TRUE,74,IF(Worksheet!C41=\"E\",340,IF(Worksheet!C41=\"D\",77,IF(OR(Worksheet!C41=\"PTAC\",Worksheet!C41=\"PTHP\")=TRUE,75,IF(Worksheet!C41=\"W\",78,IF(Worksheet!C41=\"O\",222,73)))))))","v":""},{"$f":"IF(ISBLANK(Worksheet!D41)=FALSE,Worksheet!D41,\"\")","v":""},{"$f":"IF(ISBLANK(Worksheet!E41)=FALSE,Worksheet!E41,\"\")","v":""},{"$f":"Worksheet!K41","v":0},"Btuh",{"$f":"IF(Worksheet!K41>=65000,Worksheet!L41,\"\")","v":""},{"$f":"IF(Worksheet!K41<65000,Worksheet!L41,\"\")","v":0},{"$f":"Worksheet!R41","v":0},{"$f":"IF(ISBLANK(Worksheet!P41)=FALSE,Worksheet!P41,\"\")","v":""},{"$f":"Worksheet!AB41","v":0},{"$f":"Worksheet!Y41","v":0},{"$f":"IFERROR(Worksheet!AJ41/I23,\"\")","v":""},{"$f":"IF(ISBLANK($I23),\"\",IFERROR(Worksheet!AH41/$I23,\"\"))","v":""},{"$f":"IF(ISBLANK($I23),\"\",IFERROR(Worksheet!AL41/$I23,\"\"))","v":""},null,null,null,{"$f":"IF(ISBLANK(Worksheet!Q41)=FALSE,Worksheet!Q41,\"\")","v":""},{"$f":"IF(Worksheet!$A$10=TRUE,\"Y\",\"N\")","v":"N"},{"$f":"IF(Worksheet!$A$11=TRUE,\"Y\",\"N\")","v":"N"},{"$f":"IF(Worksheet!$C$10=TRUE,\"Y\",\"N\")","v":"N"},{"$f":"IF(Worksheet!$C$11=TRUE,\"Y\",\"N\")","v":"N"},{"$f":"IF(Worksheet!$D$10=TRUE,\"Y\",\"N\")","v":"N"},{"$f":"IF(Worksheet!$D$11=TRUE,\"Y\",\"N\")","v":"N"},{"$f":"IFERROR(Worksheet!S41,\"\")","v":0}]
[{"$f":"IF(Worksheet!R42=0,\"\",IF(OR(Worksheet!C42=\"AS\",Worksheet!C42=\"AP\")=TRUE,74,IF(Worksheet!C42=\"E\",340,IF(Worksheet!C42=\"D\",77,IF(OR(Worksheet!C42=\"PTAC\",Worksheet!C42=\"PTHP\")=TRUE,75,IF(Worksheet!C42=\"W\",78,IF(Worksheet!C42=\"O\",222,73)))))))","v":""},{"$f":"IF(ISBLANK(Worksheet!D42)=FALSE,Worksheet!D42,\"\")","v":""},{"$f":"IF(ISBLANK(Worksheet!E42)=FALSE,Worksheet!E42,\"\")","v":""},{"$f":"Worksheet!K42","v":0},"Btuh",{"$f":"IF(Worksheet!K42>=65000,Worksheet!L42,\"\")","v":""},{"$f":"IF(Worksheet!K42<65000,Worksheet!L42,\"\")","v":0},{"$f":"Worksheet!R42","v":0},{"$f":"IF(ISBLANK(Worksheet!P42)=FALSE,Worksheet!P42,\"\")","v":""},{"$f":"Worksheet!AB42","v":0},{"$f":"Worksheet!Y42","v":0},{"$f":"IFERROR(Worksheet!AJ42/I24,\"\")","v":""},{"$f":"IF(ISBLANK($I24),\"\",IFERROR(Worksheet!AH42/$I24,\"\"))","v":""},{"$f":"IF(ISBLANK($I24),\"\",IFERROR(Worksheet!AL42/$I24,\"\"))","v":""},null,null,null,{"$f":"IF(ISBLANK(Worksheet!Q42)=FALSE,Worksheet!Q42,\"\")","v":""},{"$f":"IF(Worksheet!$A$10=TRUE,\"Y\",\"N\")","v":"N"},{"$f":"IF(Worksheet!$A$11=TRUE,\"Y\",\"N\")","v":"N"},{"$f":"IF(Worksheet!$C$10=TRUE,\"Y\",\"N\")","v":"N"},{"$f":"IF(Worksheet!$C$11=TRUE,\"Y\",\"N\")","v":"N"},{"$f":"IF(Worksheet!$D$10=TRUE,\"Y\",\"N\")","v":"N"},{"$f":"IF(Worksheet!$D$11=TRUE,\"Y\",\"N\")","v":"N"},{"$f":"IFERROR(Worksheet!S42,\"\")","v":0}]
[{"$f":"IF(Worksheet!R43=0,\"\",IF(OR(Worksheet!C43=\"AS\",Worksheet!C43=\"AP\")=TRUE,74,IF(Worksheet!C43=\"E\",340,IF(Worksheet!C43=\"D\",77,IF(OR(Worksheet!C43=\"PTAC\",Worksheet!C43=\"PTHP\")=TRUE,75,IF(Worksheet!C43=\"W\",78,IF(Worksheet!C43=\"O\",222,73)))))))","v":""},{"$f":"IF(ISBLANK(Worksheet!D43)=FALSE,Worksheet!D43,\"\")","v":""},{"$f":"IF(ISBLANK(Worksheet!E43)=FALSE,Worksheet!E43,\"\")","v":""},{"$f":"Worksheet!K43","v":0},"Btuh",{"$f":"IF(Worksheet!K43>=65000,Worksheet!L43,\"\")","v":""},{"$f":"IF(Worksheet!K43<65000,Worksheet!L43,\"\")","v":0},{"$f":"Worksheet!R43","v":0},{"$f":"IF(ISBLANK(Worksheet!P43)=FALSE,Worksheet!P43,\"\")","v":""},{"$f":"Worksheet!AB43","v":0},{"$f":"Worksheet!Y43","v":0},{"$f":"IFERROR(Worksheet!AJ43/I25,\"\")","v":""},{"$f":"IF(ISBLANK($I25),\"\",IFERROR(Worksheet!AH43/$I25,\"\"))","v":""},{"$f":"IF(ISBLANK($I25),\"\",IFERROR(Worksheet!AL43/$I25,\"\"))","v":""},null,null,null,{"$f":"IF(ISBLANK(Worksheet!Q43)=FALSE,Worksheet!Q43,\"\")","v":""},{"$f":"IF(Worksheet!$A$10=TRUE,\"Y\",\"N\")","v":"N"},{"$f":"IF(Worksheet!$A$11=TRUE,\"Y\",\"N\")","v":"N"},{"$f":"IF(Worksheet!$C$10=TRUE,\"Y\",\"N\")","v":"N"},{"$f":"IF(Worksheet!$C$11=TRUE,\"Y\",\"N\")","v":"N"},{"$f":"IF(Worksheet!$D$10=TRUE,\"Y\",\"N\")","v":"N"},{"$f":"IF(Worksheet!$D$11=TRUE,\"Y\",\"N\")","v":"N"},{"$f":"IFERROR(Worksheet!S43,\"\")","v":0}]
[{"$f":"IF(Worksheet!R44=0,\"\",IF(OR(Worksheet!C44=\"AS\",Worksheet!C44=\"AP\")=TRUE,74,IF(Worksheet!C44=\"E\",340,IF(Worksheet!C44=\"D\",77,IF(OR(Worksheet!C44=\"PTAC\",Worksheet!C44=\"PTHP\")=TRUE,75,IF(Worksheet!C44=\"W\",78,IF(Worksheet!C44=\"O\",222,73)))))))","v":""},{"$f":"IF(ISBLANK(Worksheet!D44)=FALSE,Worksheet!D44,\"\")","v":""},{"$f":"IF(ISBLANK(Worksheet!E44)=FALSE,Worksheet!E44,\"\")","v":""},{"$f":"Worksheet!K44","v":0},"Btuh",{"$f":"IF(Worksheet!K44>=65000,Worksheet!L44,\"\")","v":""},{"$f":"IF(Worksheet!K44<65000,Worksheet!L44,\"\")","v":0},{"$f":"Worksheet!R44","v":0},{"$f":"IF(ISBLANK(Worksheet!P44)=FALSE,Worksheet!P44,\"\")","v":""},{"$f":"Worksheet!AB44","v":0},{"$f":"Worksheet!Y44","v":0},{"$f":"IFERROR(Worksheet!AJ44/I26,\"\")","v":""},{"$f":"IF(ISBLANK($I26),\"\",IFERROR(Worksheet!AH44/$I26,\"\"))","v":""},{"$f":"IF(ISBLANK($I26),\"\",IFERROR(Worksheet!AL44/$I26,\"\"))","v":""},null,null,null,{"$f":"IF(ISBLANK(Worksheet!Q44)=FALSE,Worksheet!Q44,\"\")","v":""},{"$f":"IF(Worksheet!$A$10=TRUE,\"Y\",\"N\")","v":"N"},{"$f":"IF(Worksheet!$A$11=TRUE,\"Y\",\"N\")","v":"N"},{"$f":"IF(Worksheet!$C$10=TRUE,\"Y\",\"N\")","v":"N"},{"$f":"IF(Worksheet!$C$11=TRUE,\"Y\",\"N\")","v":"N"},{"$f":"IF(Worksheet!$D$10=TRUE,\"Y\",\"N\")","v":"N"},{"$f":"IF(Worksheet!$D$11=TRUE,\"Y\",\"N\")","v":"N"},{"$f":"IFERROR(Worksheet!S44,\"\")","v":0}]

{"sheet":"Version","index":4,"n_rows":15,"n_cols":3,"rows_kept":15,"cut":false,"hidden":true,"merged":[]}
[14,"<-Version"]
[]
["Log"]
["1/1/2008 Baseline efficiencies updated to comply with new protocol"]
["12/1/2008 updated for measure tracking compatability"]
["7/13/2009 entered formula for baseline efficiency into \"n\"-column cells to reflect protocol."]
["10/18/2009 added separate Dual Enthalpy Control system in order for correct incentive to export"]
["(missed updates)"]
["2011-03-15",null,"fixed error in export tab where the quantity was left out in a certain row"]
["2012-01-13","V5","added fuel use economizers"]
["2013-07-09","V7","no change for V7, skipped V6"]
["2014-08-13",null,"updated dual enthalpy formula for demand savings in VBA code; updated central dx baseline to match other DX systems, also in VBA code"]
["2018-06-21","V12","Removed Dual Enthalpy Economizer measure and updated to align with FY19 Protocols"]
["2019-07-01","V13","Added Enhanced Incentive Eligibility Section and Updated for FY20 Program"]
["2020-10-01","V14","Updated for FY21 Program"]