{"text_format":"1","workbook":"xlsx","n_sheets":5,"sheets":["Worksheet","Measure Code","Table","Export","Version"],"not_rendered":{"charts":0,"images":0,"macros":1,"external_links":1,"defined_names":11,"comments":1,"pivot_tables":0},"unopened":[],"bounds":{"document_bytes":16777216,"sheet_cells":100000,"rows_first":2000,"rows_last":500,"rows_between":2000,"halvings":0,"cell_chars":16384,"cell_head_chars":4096},"cells_cut":0,"cells_raw":0,"read":"whole","date_system":"1900"}

{"sheet":"Worksheet","index":0,"n_rows":46,"n_cols":37,"rows_kept":46,"cut":false,"hidden":false,"merged":[[0,0,0,5],[3,10,3,21],[15,9,18,9],[15,20,19,20],[15,6,19,6],[15,7,19,7],[15,0,19,0],[15,3,19,3],[15,11,19,11],[15,4,19,4],[15,5,19,5],[15,2,19,2],[4,10,4,11],[13,22,13,24],[12,22,12,24],[13,2,13,4],[8,2,8,5],[8,10,8,12],[15,34,19,34],[15,35,19,35],[15,27,19,27],[15,30,19,30],[15,31,19,31],[15,28,19,28],[15,32,19,32],[15,29,19,29],[15,33,19,33],[3,36,3,38],[4,36,7,38],[3,33,3,35],[4,33,7,35],[7,2,7,5],[7,10,7,21],[5,2,5,5],[4,2,4,5],[3,2,3,5],[15,26,19,26],[16,17,19,17],[16,19,19,19],[16,18,19,18],[15,10,19,10],[16,13,19,13],[16,14,19,14],[16,15,19,15],[16,16,19,16],[15,25,19,25],[15,21,19,21],[15,22,19,22],[15,23,19,23],[15,24,19,24]]}
["FY25 SmartStart New Construction - Variable Frequency Drives v1.0",null,null,null,null,null,null,null,null,"Incentive amounts are estimates until verified by the Program Manager."]
[]
["Customer Information"]
["Name",null,null,null,null,null,null,null,null,"Address",null,null,null,null,null,null,null,null,null,null,null,null,null,null,null,null,null,null,null,null,null,null,null,"Pre-Inspection Notes",null,null,"Post-Inspection Notes"]
["Application",null,null,null,null,null,null,null,null,"Date"]
["Contact"]
["Contractor/Vendor Information",null,null,null,null,null,null,null,null,null,null,null,null,null,null,null,null,null,null,null,null,null,null,null,null,null,null,null,null,null,"Inspection Type"]
["Name",null,null,null,null,null,null,null,null,"Address"]
["Contact",null,null,null,null,null,null,null,null,"Phone"]
["Enhanced Incentive Eligibility"]
[false,null,false,false]
[false,null,false,false]
[null,null,null,null,null,null,null,null,null,null,null,null,null,null,null,null,null,null,null,null,null,null,"Total Units Committed:",null,null,{"$f":"SUM(U21:U46)","v":0}]
["Project Type",null,null,null,null,null,null,null,null,null,null,null,null,null,null,null,null,null,null,null,null,null,"Total Units Installed:",null,null,{"$f":"SUM(V21:V46)","v":0}]
[null,null,null,null,null,null,null,null,null,null,null,null,null,null,null,null,null,null,null,null,null,null,"Totals",null,{"$f":"SUMIF($Y$21:$Y$46,\"<>#N/A\",$Y$21:$Y$46)","v":0},{"$f":"SUMIF($Z$21:$Z$46,\"<>#N/A\",$Z$21:$Z$46)","v":0},{"$f":"SUM(AA21:AA46)","v":0},0,0,0,0,0,0,0,0,0]
{"$rows_left_out":32}
{"sheet":"Measure Code","index":1,"n_rows":12,"n_cols":5,"rows_kept":12,"cut":false,"hidden":true,"merged":[]}
["Measure Code","Application Incentive Table Abbreviation","Worksheet Selection","Description","Measure ID"]
["VFD1","VAV","VAV-F","Variable Air Volume HVAC Systems - Airfoil/Backward Inclined Fan",84]
["VFD2","VAV","VAV-C","Variable Air Volume HVAC Systems - Forward Curved Fan",84]
["VFD3","CV","CV-F","Constant Volume HVAC Systems - Airfoil/Backward Inclined Fan",431]
["VFD4","CV","CV-C","Constant Volume HVAC Systems - Forward Curved Fan",431]
["VFD5","T","T","Cooling Tower Fan",453]
["VFD6","P","P","Chilled Water Pump",85]
["VFD7","A","A","Air Compressor",86]
["VFD8","BP","BP","Boiler Feedwater Pump",454]
["VFD9","BF","BF-F","Boiler Fan Motor - Airfoil/backward Inclined Fan",452]
["VFD10","BF","BF-C","Boiler Fan Motor - Forward Curved",452]
["VFD11","K","K","Kitchen Hoods",455]

{"sheet":"Table","index":2,"n_rows":19,"n_cols":19,"rows_kept":19,"cut":false,"hidden":true,"merged":[]}
["Abbreviation","Description","Measure ID","Minimum HP","Maximum HP",null,"Motor Application","Energy Savings Factor (kWh/HP)","Demand Savings Factor (kW/HP)",null,"Facility Type","Run Hours","CDD","HDD","Power Reduction (PR)","Flow Reduction (FR)",null,"Motor Size (HP)","Incentive ($)"]
["VAV-F","Variable Air Volume HVAC Systems - Airfoil/Backward Inclined Fan",84,5,50,null,"Supply Fan",2033,0.28599999999999998,null,"Campus",5250,824,2792,0.56799999999999995,0.29499999999999998,null,0.5,50]
["VAV-C","Variable Air Volume HVAC Systems - Forward Curved Fan",84,5,50,null,"Return Fan",1788,0.29699999999999999,null,"Lodging",8736,420,1420,0.61799999999999999,0.33,null,1,75]
["CV-F","Constant Volume HVAC Systems - Airfoil/Backward Inclined Fan",431,0.5,50,null,"Makeup Air Fan",2033,0.28599999999999998,null,"Restaurant",5824,1094,3691,0.55200000000000005,0.29499999999999998,null,2,100]
["CV-C","Constant Volume HVAC Systems - Forward Curved Fan",431,0.5,50,null,"Cooling Tower Fan",290,-2.5000000000000001E-2,null,"Supermarket",5824,989,3369,0.59699999999999998,0.32,null,3,200]
["T","Cooling Tower Fan",453,10,50,null,"Chilled Water Pump",1633,0.185,null,"Other",5250,{"$f":"AVERAGE(M2:M5)","v":831.75},{"$f":"AVERAGE(N2:N5)","v":2818},0.58399999999999996,0.31,null,4,300]
["P","Chilled Water Pump",85,20,50,null,"Air Compressor",968,0.14599999999999999,null,null,null,null,null,null,null,null,5,900]
["A","Air Compressor",86,25,200,null,"Boiler Feedwater Pump",1588,0.498,null,null,null,null,null,null,null,null,7.5,1000]
["BP","Boiler Feedwater Pump",454,5,50,null,"Boiler Fan Motor - Airfoil/backward Inclined Fan",1788,0.29699999999999999,null,null,null,null,null,null,null,null,10,1100]
["BF-F","Boiler Fan Motor - Airfoil/backward Inclined Fan",452,5,50,null,"Boiler Fan Motor - Forward Curved",1788,0.29699999999999999,null,null,null,null,null,null,null,null,15,1200]
["BF-C","Boiler Fan Motor - Forward Curved",452,5,50,null,"Kitchen Hood Exhaust Fan","N/A","N/A",null,null,null,null,null,null,null,null,20,1300]
["K","Kitchen Hoods",455,0.5,50,null,null,null,null,null,null,null,null,null,null,null,null,25,1400]
[null,null,null,null,null,null,null,null,null,null,null,null,null,null,null,null,null,30,1500]
[null,null,null,null,null,null,null,null,null,null,null,null,null,null,null,null,null,40,2500]
[null,null,null,null,null,null,null,null,null,null,null,null,null,null,null,null,null,50,3000]
{"$rows_left_out":5}
{"sheet":"Export","index":3,"n_rows":27,"n_cols":25,"rows_kept":27,"cut":false,"hidden":true,"merged":[]}
["Measure Type","Manufacturer","Model","Capacity/Size","Capacity/Size Units","EER Efficiency","SEER Efficiency","Incentive Per Unit","Quantity Committed","Annual Electricity Savings","Peak Demand Reduction","Lifetime Electricity Savings","Annual Gas Savings","Lifetime Gas Savings","Efficiency- other","Efficiency- other-type","Measure ID removed","Quantity Installed","Project in UEZ","Project in OZ","Municipality","K-12 School","County","Affordable Housing","Enhanced Incentive per Unit"]
[{"$f":"IF(ISBLANK(Worksheet!U21)=FALSE,VLOOKUP(Worksheet!C21,VFDTable,3,FALSE),\"\")","v":""},{"$f":"Worksheet!E21","v":0},{"$f":"Worksheet!F21","v":0},{"$f":"Worksheet!J21","v":0},"HP",null,null,{"$f":"Worksheet!W21","v":0},{"$f":"IF(ISBLANK(Worksheet!U21)=FALSE,Worksheet!U21,\"\")","v":""},{"$f":"IF(H2=0,0,Worksheet!AA21/I2)","v":0},{"$f":"IF(H2=0,0,Worksheet!AE21/I2)","v":0},{"$f":"J2*15","v":0},{"$f":"IF(H2=0,0,Worksheet!AG21/I2)","v":0},{"$f":"M2*15","v":0},{"$f":"Worksheet!K21","v":0},"%",null,{"$f":"IF(ISBLANK(Worksheet!V21)=FALSE,Worksheet!V21,\"\")","v":""},{"$f":"IF(Worksheet!$A$11=TRUE,\"Y\",\"N\")","v":"N"},{"$f":"IF(Worksheet!$A$12=TRUE,\"Y\",\"N\")","v":"N"},{"$f":"IF(Worksheet!$C$11=TRUE,\"Y\",\"N\")","v":"N"},{"$f":"IF(Worksheet!$C$12=TRUE,\"Y\",\"N\")","v":"N"},{"$f":"IF(Worksheet!$D$11=TRUE,\"Y\",\"N\")","v":"N"},{"$f":"IF(Worksheet!$D$12=TRUE,\"Y\",\"N\")","v":"N"},{"$f":"IFERROR(Worksheet!X21,\"\")","v":0}]
[{"$f":"IF(ISBLANK(Worksheet!U22)=FALSE,VLOOKUP(Worksheet!C22,VFDTable,3,FALSE),\"\")","v":""},{"$f":"Worksheet!E22","v":0},{"$f":"Worksheet!F22","v":0},{"$f":"Worksheet!J22","v":0},"HP",null,null,{"$f":"Worksheet!W22","v":0},{"$f":"IF(ISBLANK(Worksheet!U22)=FALSE,Worksheet!U22,\"\")","v":""},{"$f":"IF(H3=0,0,Worksheet!AA22/I3)","v":0},{"$f":"IF(H3=0,0,Worksheet!AE22/I3)","v":0},{"$f":"J3*15","v":0},{"$f":"IF(H3=0,0,Worksheet!AG22/I3)","v":0},{"$f":"M3*15","v":0},{"$f":"Worksheet!K22","v":0},"%",null,{"$f":"IF(ISBLANK(Worksheet!V22)=FALSE,Worksheet!V22,\"\")","v":""},{"$f":"IF(Worksheet!$A$11=TRUE,\"Y\",\"N\")","v":"N"},{"$f":"IF(Worksheet!$A$12=TRUE,\"Y\",\"N\")","v":"N"},{"$f":"IF(Worksheet!$C$11=TRUE,\"Y\",\"N\")","v":"N"},{"$f":"IF(Worksheet!$C$12=TRUE,\"Y\",\"N\")","v":"N"},{"$f":"IF(Worksheet!$D$11=TRUE,\"Y\",\"N\")","v":"N"},{"$f":"IF(Worksheet!$D$12=TRUE,\"Y\",\"N\")","v":"N"},{"$f":"IFERROR(Worksheet!X22,\"\")","v":0}]
[{"$f":"IF(ISBLANK(Worksheet!U23)=FALSE,VLOOKUP(Worksheet!C23,VFDTable,3,FALSE),\"\")","v":""},{"$f":"Worksheet!E23","v":0},{"$f":"Worksheet!F23","v":0},{"$f":"Worksheet!J23","v":0},"HP",null,null,{"$f":"Worksheet!W23","v":0},{"$f":"IF(ISBLANK(Worksheet!U23)=FALSE,Worksheet!U23,\"\")","v":""},{"$f":"IF(H4=0,0,Worksheet!AA23/I4)","v":0},{"$f":"IF(H4=0,0,Worksheet!AE23/I4)","v":0},0,{"$f":"IF(H4=0,0,Worksheet!AG23/I4)","v":0},0,{"$f":"Worksheet!K23","v":0},"%",null,{"$f":"IF(ISBLANK(Worksheet!V23)=FALSE,Worksheet!V23,\"\")","v":""},{"$f":"IF(Worksheet!$A$11=TRUE,\"Y\",\"N\")","v":"N"},{"$f":"IF(Worksheet!$A$12=TRUE,\"Y\",\"N\")","v":"N"},{"$f":"IF(Worksheet!$C$11=TRUE,\"Y\",\"N\")","v":"N"},{"$f":"IF(Worksheet!$C$12=TRUE,\"Y\",\"N\")","v":"N"},{"$f":"IF(Worksheet!$D$11=TRUE,\"Y\",\"N\")","v":"N"},{"$f":"IF(Worksheet!$D$12=TRUE,\"Y\",\"N\")","v":"N"},{"$f":"IFERROR(Worksheet!X23,\"\")","v":0}]
[{"$f":"IF(ISBLANK(Worksheet!U24)=FALSE,VLOOKUP(Worksheet!C24,VFDTable,3,FALSE),\"\")","v":""},{"$f":"Worksheet!E24","v":0},{"$f":"Worksheet!F24","v":0},{"$f":"Worksheet!J24","v":0},"HP",null,null,{"$f":"Worksheet!W24","v":0},{"$f":"IF(ISBLANK(Worksheet!U24)=FALSE,Worksheet!U24,\"\")","v":""},{"$f":"IF(H5=0,0,Worksheet!AA24/I5)","v":0},{"$f":"IF(H5=0,0,Worksheet!AE24/I5)","v":0},0,{"$f":"IF(H5=0,0,Worksheet!AG24/I5)","v":0},0,{"$f":"Worksheet!K24","v":0},"%",null,{"$f":"IF(ISBLANK(Worksheet!V24)=FALSE,Worksheet!V24,\"\")","v":""},{"$f":"IF(Worksheet!$A$11=TRUE,\"Y\",\"N\")","v":"N"},{"$f":"IF(Worksheet!$A$12=TRUE,\"Y\",\"N\")","v":"N"},{"$f":"IF(Worksheet!$C$11=TRUE,\"Y\",\"N\")","v":"N"},{"$f":"IF(Worksheet!$C$12=TRUE,\"Y\",\"N\")","v":"N"},{"$f":"IF(Worksheet!$D$11=TRUE,\"Y\",\"N\")","v":"N"},{"$f":"IF(Worksheet!$D$12=TRUE,\"Y\",\"N\")","v":"N"},{"$f":"IFERROR(Worksheet!X24,\"\")","v":0}]
[{"$f":"IF(ISBLANK(Worksheet!U25)=FALSE,VLOOKUP(Worksheet!C25,VFDTable,3,FALSE),\"\")","v":""},{"$f":"Worksheet!E25","v":0},{"$f":"Worksheet!F25","v":0},{"$f":"Worksheet!J25","v":0},"HP",null,null,{"$f":"Worksheet!W25","v":0},{"$f":"IF(ISBLANK(Worksheet!U25)=FALSE,Worksheet!U25,\"\")","v":""},{"$f":"IF(H6=0,0,Worksheet!AA25/I6)","v":0},{"$f":"IF(H6=0,0,Worksheet!AE25/I6)","v":0},0,{"$f":"IF(H6=0,0,Worksheet!AG25/I6)","v":0},0,{"$f":"Worksheet!K25","v":0},"%",null,{"$f":"IF(ISBLANK(Worksheet!V25)=FALSE,Worksheet!V25,\"\")","v":""},{"$f":"IF(Worksheet!$A$11=TRUE,\"Y\",\"N\")","v":"N"},{"$f":"IF(Worksheet!$A$12=TRUE,\"Y\",\"N\")","v":"N"},{"$f":"IF(Worksheet!$C$11=TRUE,\"Y\",\"N\")","v":"N"},{"$f":"IF(Worksheet!$C$12=TRUE,\"Y\",\"N\")","v":"N"},{"$f":"IF(Worksheet!$D$11=TRUE,\"Y\",\"N\")","v":"N"},{"$f":"IF(Worksheet!$D$12=TRUE,\"Y\",\"N\")","v":"N"},{"$f":"IFERROR(Worksheet!X25,\"\")","v":0}]
[{"$f":"IF(ISBLANK(Worksheet!U26)=FALSE,VLOOKUP(Worksheet!C26,VFDTable,3,FALSE),\"\")","v":""},{"$f":"Worksheet!E26","v":0},{"$f":"Worksheet!F26","v":0},{"$f":"Worksheet!J26","v":0},"HP",null,null,{"$f":"Worksheet!W26","v":0},{"$f":"IF(ISBLANK(Worksheet!U26)=FALSE,Worksheet!U26,\"\")","v":""},{"$f":"IF(H7=0,0,Worksheet!AA26/I7)","v":0},{"$f":"IF(H7=0,0,Worksheet!AE26/I7)","v":0},0,{"$f":"IF(H7=0,0,Worksheet!AG26/I7)","v":0},0,{"$f":"Worksheet!K26","v":0},"%",null,{"$f":"IF(ISBLANK(Worksheet!V26)=FALSE,Worksheet!V26,\"\")","v":""},{"$f":"IF(Worksheet!$A$11=TRUE,\"Y\",\"N\")","v":"N"},{"$f":"IF(Worksheet!$A$12=TRUE,\"Y\",\"N\")","v":"N"},{"$f":"IF(Worksheet!$C$11=TRUE,\"Y\",\"N\")","v":"N"},{"$f":"IF(Worksheet!$C$12=TRUE,\"Y\",\"N\")","v":"N"},{"$f":"IF(Worksheet!$D$11=TRUE,\"Y\",\"N\")","v":"N"},{"$f":"IF(Worksheet!$D$12=TRUE,\"Y\",\"N\")","v":"N"},{"$f":"IFERROR(Worksheet!X26,\"\")","v":0}]
[{"$f":"IF(ISBLANK(Worksheet!U27)=FALSE,VLOOKUP(Worksheet!C27,VFDTable,3,FALSE),\"\")","v":""},{"$f":"Worksheet!E27","v":0},{"$f":"Worksheet!F27","v":0},{"$f":"Worksheet!J27","v":0},"HP",null,null,{"$f":"Worksheet!W27","v":0},{"$f":"IF(ISBLANK(Worksheet!U27)=FALSE,Worksheet!U27,\"\")","v":""},{"$f":"IF(H8=0,0,Worksheet!AA27/I8)","v":0},{"$f":"IF(H8=0,0,Worksheet!AE27/I8)","v":0},0,{"$f":"IF(H8=0,0,Worksheet!AG27/I8)","v":0},0,{"$f":"Worksheet!K27","v":0},"%",null,{"$f":"IF(ISBLANK(Worksheet!V27)=FALSE,Worksheet!V27,\"\")","v":""},{"$f":"IF(Worksheet!$A$11=TRUE,\"Y\",\"N\")","v":"N"},{"$f":"IF(Worksheet!$A$12=TRUE,\"Y\",\"N\")","v":"N"},{"$f":"IF(Worksheet!$C$11=TRUE,\"Y\",\"N\")","v":"N"},{"$f":"IF(Worksheet!$C$12=TRUE,\"Y\",\"N\")","v":"N"},{"$f":"IF(Worksheet!$D$11=TRUE,\"Y\",\"N\")","v":"N"},{"$f":"IF(Worksheet!$D$12=TRUE,\"Y\",\"N\")","v":"N"},{"$f":"IFERROR(Worksheet!X27,\"\")","v":0}]
[{"$f":"IF(ISBLANK(Worksheet!U28)=FALSE,VLOOKUP(Worksheet!C28,VFDTable,3,FALSE),\"\")","v":""},{"$f":"Worksheet!E28","v":0},{"$f":"Worksheet!F28","v":0},{"$f":"Worksheet!J28","v":0},"HP",null,null,{"$f":"Worksheet!W28","v":0},{"$f":"IF(ISBLANK(Worksheet!U28)=FALSE,Worksheet!U28,\"\")","v":""},{"$f":"IF(H9=0,0,Worksheet!AA28/I9)","v":0},{"$f":"IF(H9=0,0,Worksheet!AE28/I9)","v":0},0,{"$f":"IF(H9=0,0,Worksheet!AG28/I9)","v":0},0,{"$f":"Worksheet!K28","v":0},"%",null,{"$f":"IF(ISBLANK(Worksheet!V28)=FALSE,Worksheet!V28,\"\")","v":""},{"$f":"IF(Worksheet!$A$11=TRUE,\"Y\",\"N\")","v":"N"},{"$f":"IF(Worksheet!$A$12=TRUE,\"Y\",\"N\")","v":"N"},{"$f":"IF(Worksheet!$C$11=TRUE,\"Y\",\"N\")","v":"N"},{"$f":"IF(Worksheet!$C$12=TRUE,\"Y\",\"N\")","v":"N"},{"$f":"IF(Worksheet!$D$11=TRUE,\"Y\",\"N\")","v":"N"},{"$f":"IF(Worksheet!$D$12=TRUE,\"Y\",\"N\")","v":"N"},{"$f":"IFERROR(Worksheet!X28,\"\")","v":0}]
[{"$f":"IF(ISBLANK(Worksheet!U29)=FALSE,VLOOKUP(Worksheet!C29,VFDTable,3,FALSE),\"\")","v":""},{"$f":"Worksheet!E29","v":0},{"$f":"Worksheet!F29","v":0},{"$f":"Worksheet!J29","v":0},"HP",null,null,{"$f":"Worksheet!W29","v":0},{"$f":"IF(ISBLANK(Worksheet!U29)=FALSE,Worksheet!U29,\"\")","v":""},{"$f":"IF(H10=0,0,Worksheet!AA29/I10)","v":0},{"$f":"IF(H10=0,0,Worksheet!AE29/I10)","v":0},0,{"$f":"IF(H10=0,0,Worksheet!AG29/I10)","v":0},0,{"$f":"Worksheet!K29","v":0},"%",null,{"$f":"IF(ISBLANK(Worksheet!V29)=FALSE,Worksheet!V29,\"\")","v":""},{"$f":"IF(Worksheet!$A$11=TRUE,\"Y\",\"N\")","v":"N"},{"$f":"IF(Worksheet!$A$12=TRUE,\"Y\",\"N\")","v":"N"},{"$f":"IF(Worksheet!$C$11=TRUE,\"Y\",\"N\")","v":"N"},{"$f":"IF(Worksheet!$C$12=TRUE,\"Y\",\"N\")","v":"N"},{"$f":"IF(Worksheet!$D$11=TRUE,\"Y\",\"N\")","v":"N"},{"$f":"IF(Worksheet!$D$12=TRUE,\"Y\",\"N\")","v":"N"},{"$f":"IFERROR(Worksheet!X29,\"\")","v":0}]
[{"$f":"IF(ISBLANK(Worksheet!U30)=FALSE,VLOOKUP(Worksheet!C30,VFDTable,3,FALSE),\"\")","v":""},{"$f":"Worksheet!E30","v":0},{"$f":"Worksheet!F30","v":0},{"$f":"Worksheet!J30","v":0},"HP",null,null,{"$f":"Worksheet!W30","v":0},{"$f":"IF(ISBLANK(Worksheet!U30)=FALSE,Worksheet!U30,\"\")","v":""},{"$f":"IF(H11=0,0,Worksheet!AA30/I11)","v":0},{"$f":"IF(H11=0,0,Worksheet!AE30/I11)","v":0},0,{"$f":"IF(H11=0,0,Worksheet!AG30/I11)","v":0},0,{"$f":"Worksheet!K30","v":0},"%",null,{"$f":"IF(ISBLANK(Worksheet!V30)=FALSE,Worksheet!V30,\"\")","v":""},{"$f":"IF(Worksheet!$A$11=TRUE,\"Y\",\"N\")","v":"N"},{"$f":"IF(Worksheet!$A$12=TRUE,\"Y\",\"N\")","v":"N"},{"$f":"IF(Worksheet!$C$11=TRUE,\"Y\",\"N\")","v":"N"},{"$f":"IF(Worksheet!$C$12=TRUE,\"Y\",\"N\")","v":"N"},{"$f":"IF(Worksheet!$D$11=TRUE,\"Y\",\"N\")","v":"N"},{"$f":"IF(Worksheet!$D$12=TRUE,\"Y\",\"N\")","v":"N"},{"$f":"IFERROR(Worksheet!X30,\"\")","v":0}]
[{"$f":"IF(ISBLANK(Worksheet!U31)=FALSE,VLOOKUP(Worksheet!C31,VFDTable,3,FALSE),\"\")","v":""},{"$f":"Worksheet!E31","v":0},{"$f":"Worksheet!F31","v":0},{"$f":"Worksheet!J31","v":0},"HP",null,null,{"$f":"Worksheet!W31","v":0},{"$f":"IF(ISBLANK(Worksheet!U31)=FALSE,Worksheet!U31,\"\")","v":""},{"$f":"IF(H12=0,0,Worksheet!AA31/I12)","v":0},{"$f":"IF(H12=0,0,Worksheet!AE31/I12)","v":0},0,{"$f":"IF(H12=0,0,Worksheet!AG31/I12)","v":0},0,{"$f":"Worksheet!K31","v":0},"%",null,{"$f":"IF(ISBLANK(Worksheet!V31)=FALSE,Worksheet!V31,\"\")","v":""},{"$f":"IF(Worksheet!$A$11=TRUE,\"Y\",\"N\")","v":"N"},{"$f":"IF(Worksheet!$A$12=TRUE,\"Y\",\"N\")","v":"N"},{"$f":"IF(Worksheet!$C$11=TRUE,\"Y\",\"N\")","v":"N"},{"$f":"IF(Worksheet!$C$12=TRUE,\"Y\",\"N\")","v":"N"},{"$f":"IF(Worksheet!$D$11=TRUE,\"Y\",\"N\")","v":"N"},{"$f":"IF(Worksheet!$D$12=TRUE,\"Y\",\"N\")","v":"N"},{"$f":"IFERROR(Worksheet!X31,\"\")","v":0}]
[{"$f":"IF(ISBLANK(Worksheet!U32)=FALSE,VLOOKUP(Worksheet!C32,VFDTable,3,FALSE),\"\")","v":""},{"$f":"Worksheet!E32","v":0},{"$f":"Worksheet!F32","v":0},{"$f":"Worksheet!J32","v":0},"HP",null,null,{"$f":"Worksheet!W32","v":0},{"$f":"IF(ISBLANK(Worksheet!U32)=FALSE,Worksheet!U32,\"\")","v":""},{"$f":"IF(H13=0,0,Worksheet!AA32/I13)","v":0},{"$f":"IF(H13=0,0,Worksheet!AE32/I13)","v":0},0,{"$f":"IF(H13=0,0,Worksheet!AG32/I13)","v":0},0,{"$f":"Worksheet!K32","v":0},"%",null,{"$f":"IF(ISBLANK(Worksheet!V32)=FALSE,Worksheet!V32,\"\")","v":""},{"$f":"IF(Worksheet!$A$11=TRUE,\"Y\",\"N\")","v":"N"},{"$f":"IF(Worksheet!$A$12=TRUE,\"Y\",\"N\")","v":"N"},{"$f":"IF(Worksheet!$C$11=TRUE,\"Y\",\"N\")","v":"N"},{"$f":"IF(Worksheet!$C$12=TRUE,\"Y\",\"N\")","v":"N"},{"$f":"IF(Worksheet!$D$11=TRUE,\"Y\",\"N\")","v":"N"},{"$f":"IF(Worksheet!$D$12=TRUE,\"Y\",\"N\")","v":"N"},{"$f":"IFERROR(Worksheet!X32,\"\")","v":0}]
[{"$f":"IF(ISBLANK(Worksheet!U33)=FALSE,VLOOKUP(Worksheet!C33,VFDTable,3,FALSE),\"\")","v":""},{"$f":"Worksheet!E33","v":0},{"$f":"Worksheet!F33","v":0},{"$f":"Worksheet!J33","v":0},"HP",null,null,{"$f":"Worksheet!W33","v":0},{"$f":"IF(ISBLANK(Worksheet!U33)=FALSE,Worksheet!U33,\"\")","v":""},{"$f":"IF(H14=0,0,Worksheet!AA33/I14)","v":0},{"$f":"IF(H14=0,0,Worksheet!AE33/I14)","v":0},0,{"$f":"IF(H14=0,0,Worksheet!AG33/I14)","v":0},0,{"$f":"Worksheet!K33","v":0},"%",null,{"$f":"IF(ISBLANK(Worksheet!V33)=FALSE,Worksheet!V33,\"\")","v":""},{"$f":"IF(Worksheet!$A$11=TRUE,\"Y\",\"N\")","v":"N"},{"$f":"IF(Worksheet!$A$12=TRUE,\"Y\",\"N\")","v":"N"},{"$f":"IF(Worksheet!$C$11=TRUE,\"Y\",\"N\")","v":"N"},{"$f":"IF(Worksheet!$C$12=TRUE,\"Y\",\"N\")","v":"N"},{"$f":"IF(Worksheet!$D$11=TRUE,\"Y\",\"N\")","v":"N"},{"$f":"IF(Worksheet!$D$12=TRUE,\"Y\",\"N\")","v":"N"},{"$f":"IFERROR(Worksheet!X33,\"\")","v":0}]
[{"$f":"IF(ISBLANK(Worksheet!U34)=FALSE,VLOOKUP(Worksheet!C34,VFDTable,3,FALSE),\"\")","v":""},{"$f":"Worksheet!E34","v":0},{"$f":"Worksheet!F34","v":0},{"$f":"Worksheet!J34","v":0},"HP",null,null,{"$f":"Worksheet!W34","v":0},{"$f":"IF(ISBLANK(Worksheet!U34)=FALSE,Worksheet!U34,\"\")","v":""},{"$f":"IF(H15=0,0,Worksheet!AA34/I15)","v":0},{"$f":"IF(H15=0,0,Worksheet!AE34/I15)","v":0},0,{"$f":"IF(H15=0,0,Worksheet!AG34/I15)","v":0},0,{"$f":"Worksheet!K34","v":0},"%",null,{"$f":"IF(ISBLANK(Worksheet!V34)=FALSE,Worksheet!V34,\"\")","v":""},{"$f":"IF(Worksheet!$A$11=TRUE,\"Y\",\"N\")","v":"N"},{"$f":"IF(Worksheet!$A$12=TRUE,\"Y\",\"N\")","v":"N"},{"$f":"IF(Worksheet!$C$11=TRUE,\"Y\",\"N\")","v":"N"},{"$f":"IF(Worksheet!$C$12=TRUE,\"Y\",\"N\")","v":"N"},{"$f":"IF(Worksheet!$D$11=TRUE,\"Y\",\"N\")","v":"N"},{"$f":"IF(Worksheet!$D$12=TRUE,\"Y\",\"N\")","v":"N"},{"$f":"IFERROR(Worksheet!X34,\"\")","v":0}]
{"$rows_left_out":13}
{"sheet":"Version","index":4,"n_rows":9,"n_cols":3,"rows_kept":9,"cut":false,"hidden":true,"merged":[]}
[14,"<-Version"]
[]
["2009-10-13",null,"Fixed export page s.t. incentive calculation is correct for Rotary type (removed per h.p. dependence)"]
["2012-01-13","V5","for 2012, rearranged columns B & C, added hot water pump, boiler draft fan, and kitchen hood options. Note kitchen hood savings not yet implemented"]
["2013-07-09","V7","no change for V7, skipped V6"]
["2018-06-21","V12","Updated to align with FY19 Protocols"]
["2019-07-01","V13","Added Enhanced Incentive Eligibility Section and Updated for FY20 Program"]
["2020-10-01","V14","Updated for FY21 Program"]
["2023-06-04",null,"Updated for FY24 Program by Jassimran Oberoi"]